BDBM50240477 CHEMBL4074983::US9969724, Example 44
SMILES: Cn1cc(cnc1=O)-c1ccc(C(=O)N[C@@H]2CCN(C2)c2ncc(Cl)c3c(N)noc23)c(Cl)c1
InChI Key: InChIKey=CCIDOUGFKDXCLD-CYBMUJFWSA-N
Data: 3 IC50
Activity Spreadsheet -- Enzyme Inhibition Constant Data from BindingDB
Found 3 hits for monomerid = 50240477
Trg + Lig
Ki
nM
ΔG°
kcal/mole
IC50
nM
Kd
nM
EC50/IC50
nM
koff
s-1
kon
M-1s-1
pHTemp
°C
Coagulation factor IX
(Homo sapiens (Human))
BDBM50240477
(CHEMBL4074983 | US9969724, Example 44)
Show SMILES Cn1cc(cnc1=O)-c1ccc(C(=O)N[C@@H]2CCN(C2)c2ncc(Cl)c3c(N)noc23)c(Cl)c1 |r|
Show InChI InChI=1S/C22H19Cl2N7O3/c1-30-9-12(7-27-22(30)33)11-2-3-14(15(23)6-11)21(32)28-13-4-5-31(10-13)20-18-17(16(24)8-26-20)19(25)29-34-18/h2-3,6-9,13H,4-5,10H2,1H3,(H2,25,29)(H,28,32)/t13-/m1/s1
Reactome pathway
n/an/a 36n/an/an/an/an/an/a
Mochida Pharmaceutical Co. Ltd.
Curated by ChEMBL
Assay Description
Inhibition of human coagulation factor 9a using SPECTROFLUOR F9a as substrate after 60 mins by fluorescence assay
Bioorg Med Chem Lett 27: 2622-2628 (2017)
Article DOI: 10.1016/j.bmcl.2017.03.002
BindingDB Entry DOI: 10.7270/Q28054RH
Coagulation factor IX
(Homo sapiens (Human))
BDBM50240477
(CHEMBL4074983 | US9969724, Example 44)
Show SMILES Cn1cc(cnc1=O)-c1ccc(C(=O)N[C@@H]2CCN(C2)c2ncc(Cl)c3c(N)noc23)c(Cl)c1 |r|
Show InChI InChI=1S/C22H19Cl2N7O3/c1-30-9-12(7-27-22(30)33)11-2-3-14(15(23)6-11)21(32)28-13-4-5-31(10-13)20-18-17(16(24)8-26-20)19(25)29-34-18/h2-3,6-9,13H,4-5,10H2,1H3,(H2,25,29)(H,28,32)/t13-/m1/s1
Reactome pathway
US Patent
n/an/a<100n/an/an/an/an/an/a
Universita degli Studi di Roma La Sapienza
Assay Description
Inhibitory activity against factor IXa was tested using the substrate SPECTROFLUOR FIXa (american diagnostica inc.; 500 West Avenue, Stamford, Conn. ...
J Med Chem 52: 2818-24 (2009)
BindingDB Entry DOI: 10.7270/Q2WQ063R
Coagulation factor X
(Homo sapiens (Human))
BDBM50240477
(CHEMBL4074983 | US9969724, Example 44)
Show SMILES Cn1cc(cnc1=O)-c1ccc(C(=O)N[C@@H]2CCN(C2)c2ncc(Cl)c3c(N)noc23)c(Cl)c1 |r|
Show InChI InChI=1S/C22H19Cl2N7O3/c1-30-9-12(7-27-22(30)33)11-2-3-14(15(23)6-11)21(32)28-13-4-5-31(10-13)20-18-17(16(24)8-26-20)19(25)29-34-18/h2-3,6-9,13H,4-5,10H2,1H3,(H2,25,29)(H,28,32)/t13-/m1/s1
Reactome pathway
n/an/a 2.60E+4n/an/an/an/an/an/a
Mochida Pharmaceutical Co. Ltd.
Curated by ChEMBL
Assay Description
Inhibitory activity against human plasma renin at pH 7.4
Bioorg Med Chem Lett 27: 2622-2628 (2017)
Article DOI: 10.1016/j.bmcl.2017.03.002
BindingDB Entry DOI: 10.7270/Q28054RH