BDBM50240575 CHEMBL4089245
SMILES: COc1cc(OC)c(F)c(COc2cnc(Nc3c(C)cccc3NC(=O)C=C)nc2)c1F
InChI Key: InChIKey=FSAPXEJFAWOTKO-UHFFFAOYSA-N
Data: 14 IC50
Activity Spreadsheet -- Enzyme Inhibition Constant Data from BindingDB
Found 14 hits for monomerid = 50240575
Trg + Lig
Ki
nM
ΔG°
kcal/mole
IC50
nM
Kd
nM
EC50/IC50
nM
koff
s-1
kon
M-1s-1
pHTemp
°C
Fibroblast growth factor receptor 4
(Homo sapiens (Human))
BDBM50240575
(CHEMBL4089245)
Show SMILES COc1cc(OC)c(F)c(COc2cnc(Nc3c(C)cccc3NC(=O)C=C)nc2)c1F
Show InChI InChI=1S/C23H22F2N4O4/c1-5-19(30)28-16-8-6-7-13(2)22(16)29-23-26-10-14(11-27-23)33-12-15-20(24)17(31-3)9-18(32-4)21(15)25/h5-11H,1,12H2,2-4H3,(H,28,30)(H,26,27,29)
n/an/a 3n/an/an/an/an/an/a
WuXi AppTec (Shanghai) Co., Ltd.
Curated by ChEMBL
Assay Description
Inhibition of recombinant human N-terminal His-tagged FGFR4 cytoplasmic domain (781 to 133 residues) expressed in baculovirus expression system using...
Bioorg Med Chem Lett 27: 2420-2423 (2017)
Article DOI: 10.1016/j.bmcl.2017.04.014
BindingDB Entry DOI: 10.7270/Q2M90BT6
Vascular endothelial growth factor receptor 2
(Homo sapiens (Human))
BDBM50240575
(CHEMBL4089245)
Show SMILES COc1cc(OC)c(F)c(COc2cnc(Nc3c(C)cccc3NC(=O)C=C)nc2)c1F
Show InChI InChI=1S/C23H22F2N4O4/c1-5-19(30)28-16-8-6-7-13(2)22(16)29-23-26-10-14(11-27-23)33-12-15-20(24)17(31-3)9-18(32-4)21(15)25/h5-11H,1,12H2,2-4H3,(H,28,30)(H,26,27,29)
NCI pathway
Reactome pathway
n/an/a>1.00E+4n/an/an/an/an/an/a
WuXi AppTec (Shanghai) Co., Ltd.
Curated by ChEMBL
Assay Description
Inhibition of human VEGFR2 using poly[Glu:Tyr] (4:1) as substrate measured after 120 mins in presence of [gamma33P]ATP by P81 ion exchange chromatogr...
Bioorg Med Chem Lett 27: 2420-2423 (2017)
Article DOI: 10.1016/j.bmcl.2017.04.014
BindingDB Entry DOI: 10.7270/Q2M90BT6
Tyrosine-protein kinase BTK
(Homo sapiens (Human))
BDBM50240575
(CHEMBL4089245)
Show SMILES COc1cc(OC)c(F)c(COc2cnc(Nc3c(C)cccc3NC(=O)C=C)nc2)c1F
Show InChI InChI=1S/C23H22F2N4O4/c1-5-19(30)28-16-8-6-7-13(2)22(16)29-23-26-10-14(11-27-23)33-12-15-20(24)17(31-3)9-18(32-4)21(15)25/h5-11H,1,12H2,2-4H3,(H,28,30)(H,26,27,29)
NCI pathway
Reactome pathway
n/an/a>1.00E+4n/an/an/an/an/an/a
WuXi AppTec (Shanghai) Co., Ltd.
Curated by ChEMBL
Assay Description
Inhibition of human BTK using KVEKIGEGTYGVVYK as substrate measured after 120 mins in presence of [gamma33P]ATP by P81 ion exchange chromatographic m...
Bioorg Med Chem Lett 27: 2420-2423 (2017)
Article DOI: 10.1016/j.bmcl.2017.04.014
BindingDB Entry DOI: 10.7270/Q2M90BT6
Macrophage colony stimulating factor receptor
(Homo sapiens (Human))
BDBM50240575
(CHEMBL4089245)
Show SMILES COc1cc(OC)c(F)c(COc2cnc(Nc3c(C)cccc3NC(=O)C=C)nc2)c1F
Show InChI InChI=1S/C23H22F2N4O4/c1-5-19(30)28-16-8-6-7-13(2)22(16)29-23-26-10-14(11-27-23)33-12-15-20(24)17(31-3)9-18(32-4)21(15)25/h5-11H,1,12H2,2-4H3,(H,28,30)(H,26,27,29)
n/an/a>1.00E+4n/an/an/an/an/an/a
WuXi AppTec (Shanghai) Co., Ltd.
Curated by ChEMBL
Assay Description
Inhibition of human FMS using poly[Glu:Tyr] (4:1) as substrate measured after 120 mins in presence of [gamma33P]ATP by P81 ion exchange chromatograph...
Bioorg Med Chem Lett 27: 2420-2423 (2017)
Article DOI: 10.1016/j.bmcl.2017.04.014
BindingDB Entry DOI: 10.7270/Q2M90BT6
Tyrosine-protein kinase JAK3
(Homo sapiens (Human))
BDBM50240575
(CHEMBL4089245)
Show SMILES COc1cc(OC)c(F)c(COc2cnc(Nc3c(C)cccc3NC(=O)C=C)nc2)c1F
Show InChI InChI=1S/C23H22F2N4O4/c1-5-19(30)28-16-8-6-7-13(2)22(16)29-23-26-10-14(11-27-23)33-12-15-20(24)17(31-3)9-18(32-4)21(15)25/h5-11H,1,12H2,2-4H3,(H,28,30)(H,26,27,29)
Reactome pathway
n/an/a>1.00E+4n/an/an/an/an/an/a
WuXi AppTec (Shanghai) Co., Ltd.
Curated by ChEMBL
Assay Description
Inhibition of human JAK3 using GEEEEYFELVKKKK as substrate measured after 120 mins in presence of [gamma33P]ATP by P81 ion exchange chromatographic m...
Bioorg Med Chem Lett 27: 2420-2423 (2017)
Article DOI: 10.1016/j.bmcl.2017.04.014
BindingDB Entry DOI: 10.7270/Q2M90BT6
Tyrosine-protein kinase TEC
(Homo sapiens (Human))
BDBM50240575
(CHEMBL4089245)
Show SMILES COc1cc(OC)c(F)c(COc2cnc(Nc3c(C)cccc3NC(=O)C=C)nc2)c1F
Show InChI InChI=1S/C23H22F2N4O4/c1-5-19(30)28-16-8-6-7-13(2)22(16)29-23-26-10-14(11-27-23)33-12-15-20(24)17(31-3)9-18(32-4)21(15)25/h5-11H,1,12H2,2-4H3,(H,28,30)(H,26,27,29)
Reactome pathway
n/an/a>1.00E+4n/an/an/an/an/an/a
WuXi AppTec (Shanghai) Co., Ltd.
Curated by ChEMBL
Assay Description
Inhibition of human TEC using poly[Glu:Tyr] (4:1) as substrate measured after 120 mins in presence of [gamma33P]ATP by P81 ion exchange chromatograph...
Bioorg Med Chem Lett 27: 2420-2423 (2017)
Article DOI: 10.1016/j.bmcl.2017.04.014
BindingDB Entry DOI: 10.7270/Q2M90BT6
Cytochrome P450 1A2
(Homo sapiens (Human))
BDBM50240575
(CHEMBL4089245)
Show SMILES COc1cc(OC)c(F)c(COc2cnc(Nc3c(C)cccc3NC(=O)C=C)nc2)c1F
Show InChI InChI=1S/C23H22F2N4O4/c1-5-19(30)28-16-8-6-7-13(2)22(16)29-23-26-10-14(11-27-23)33-12-15-20(24)17(31-3)9-18(32-4)21(15)25/h5-11H,1,12H2,2-4H3,(H,28,30)(H,26,27,29)
n/an/a>5.00E+4n/an/an/an/an/an/a
WuXi AppTec (Shanghai) Co., Ltd.
Curated by ChEMBL
Assay Description
Inhibition of CYP1A2 in human liver microsomes using phenacetin as substrate pretreated for 10 mins followed by substrate addition measured after 10 ...
Bioorg Med Chem Lett 27: 2420-2423 (2017)
Article DOI: 10.1016/j.bmcl.2017.04.014
BindingDB Entry DOI: 10.7270/Q2M90BT6
Cytochrome P450 2C19
(Homo sapiens (Human))
BDBM50240575
(CHEMBL4089245)
Show SMILES COc1cc(OC)c(F)c(COc2cnc(Nc3c(C)cccc3NC(=O)C=C)nc2)c1F
Show InChI InChI=1S/C23H22F2N4O4/c1-5-19(30)28-16-8-6-7-13(2)22(16)29-23-26-10-14(11-27-23)33-12-15-20(24)17(31-3)9-18(32-4)21(15)25/h5-11H,1,12H2,2-4H3,(H,28,30)(H,26,27,29)
Reactome pathway
n/an/a 1.50E+3n/an/an/an/an/an/a
WuXi AppTec (Shanghai) Co., Ltd.
Curated by ChEMBL
Assay Description
Concentration that inhibits the binding of radioligand, [3H]-ICS 205930, to 5-hydroxytryptamine 3 receptor from rat cortex
Bioorg Med Chem Lett 27: 2420-2423 (2017)
Article DOI: 10.1016/j.bmcl.2017.04.014
BindingDB Entry DOI: 10.7270/Q2M90BT6
Cytochrome P450 2C9
(Homo sapiens (Human))
BDBM50240575
(CHEMBL4089245)
Show SMILES COc1cc(OC)c(F)c(COc2cnc(Nc3c(C)cccc3NC(=O)C=C)nc2)c1F
Show InChI InChI=1S/C23H22F2N4O4/c1-5-19(30)28-16-8-6-7-13(2)22(16)29-23-26-10-14(11-27-23)33-12-15-20(24)17(31-3)9-18(32-4)21(15)25/h5-11H,1,12H2,2-4H3,(H,28,30)(H,26,27,29)
Reactome pathway
n/an/a 3.70E+3n/an/an/an/an/an/a
WuXi AppTec (Shanghai) Co., Ltd.
Curated by ChEMBL
Assay Description
Concentration that inhibits the binding of radioligand, [3H]-ICS 205930, to 5-hydroxytryptamine 3 receptor from rat cortex
Bioorg Med Chem Lett 27: 2420-2423 (2017)
Article DOI: 10.1016/j.bmcl.2017.04.014
BindingDB Entry DOI: 10.7270/Q2M90BT6
Fibroblast growth factor receptor 1
(Homo sapiens (Human))
BDBM50240575
(CHEMBL4089245)
Show SMILES COc1cc(OC)c(F)c(COc2cnc(Nc3c(C)cccc3NC(=O)C=C)nc2)c1F
Show InChI InChI=1S/C23H22F2N4O4/c1-5-19(30)28-16-8-6-7-13(2)22(16)29-23-26-10-14(11-27-23)33-12-15-20(24)17(31-3)9-18(32-4)21(15)25/h5-11H,1,12H2,2-4H3,(H,28,30)(H,26,27,29)
NCI pathway
Reactome pathway
n/an/a 8.60E+3n/an/an/an/an/an/a
WuXi AppTec (Shanghai) Co., Ltd.
Curated by ChEMBL
Assay Description
Concentration that inhibits the binding of radioligand, [3H]-ICS 205930, to 5-hydroxytryptamine 3 receptor from rat cortex
Bioorg Med Chem Lett 27: 2420-2423 (2017)
Article DOI: 10.1016/j.bmcl.2017.04.014
BindingDB Entry DOI: 10.7270/Q2M90BT6
Epidermal growth factor receptor
(Homo sapiens (Human))
BDBM50240575
(CHEMBL4089245)
Show SMILES COc1cc(OC)c(F)c(COc2cnc(Nc3c(C)cccc3NC(=O)C=C)nc2)c1F
Show InChI InChI=1S/C23H22F2N4O4/c1-5-19(30)28-16-8-6-7-13(2)22(16)29-23-26-10-14(11-27-23)33-12-15-20(24)17(31-3)9-18(32-4)21(15)25/h5-11H,1,12H2,2-4H3,(H,28,30)(H,26,27,29)
n/an/a>1.00E+4n/an/an/an/an/an/a
WuXi AppTec (Shanghai) Co., Ltd.
Curated by ChEMBL
Assay Description
Concentration that inhibits the binding of radioligand, [3H]-ICS 205930, to 5-hydroxytryptamine 3 receptor from rat cortex
Bioorg Med Chem Lett 27: 2420-2423 (2017)
Article DOI: 10.1016/j.bmcl.2017.04.014
BindingDB Entry DOI: 10.7270/Q2M90BT6
Tyrosine-protein kinase ITK/TSK
(Homo sapiens (Human))
BDBM50240575
(CHEMBL4089245)
Show SMILES COc1cc(OC)c(F)c(COc2cnc(Nc3c(C)cccc3NC(=O)C=C)nc2)c1F
Show InChI InChI=1S/C23H22F2N4O4/c1-5-19(30)28-16-8-6-7-13(2)22(16)29-23-26-10-14(11-27-23)33-12-15-20(24)17(31-3)9-18(32-4)21(15)25/h5-11H,1,12H2,2-4H3,(H,28,30)(H,26,27,29)
Reactome pathway
n/an/a>1.00E+4n/an/an/an/an/an/a
WuXi AppTec (Shanghai) Co., Ltd.
Curated by ChEMBL
Assay Description
Concentration that inhibits the binding of radioligand, [3H]-ICS 205930, to 5-hydroxytryptamine 3 receptor from rat cortex
Bioorg Med Chem Lett 27: 2420-2423 (2017)
Article DOI: 10.1016/j.bmcl.2017.04.014
BindingDB Entry DOI: 10.7270/Q2M90BT6
Cytochrome P450 3A4
(Homo sapiens (Human))
BDBM50240575
(CHEMBL4089245)
Show SMILES COc1cc(OC)c(F)c(COc2cnc(Nc3c(C)cccc3NC(=O)C=C)nc2)c1F
Show InChI InChI=1S/C23H22F2N4O4/c1-5-19(30)28-16-8-6-7-13(2)22(16)29-23-26-10-14(11-27-23)33-12-15-20(24)17(31-3)9-18(32-4)21(15)25/h5-11H,1,12H2,2-4H3,(H,28,30)(H,26,27,29)
Reactome pathway
n/an/a 6.90E+3n/an/an/an/an/an/a
WuXi AppTec (Shanghai) Co., Ltd.
Curated by ChEMBL
Assay Description
Inhibition of CYP3A4 in human liver microsomes using midazolam as substrate pretreated for 10 mins followed by substrate addition measured after 10 m...
Bioorg Med Chem Lett 27: 2420-2423 (2017)
Article DOI: 10.1016/j.bmcl.2017.04.014
BindingDB Entry DOI: 10.7270/Q2M90BT6
Cytochrome P450 2D6
(Homo sapiens (Human))
BDBM50240575
(CHEMBL4089245)
Show SMILES COc1cc(OC)c(F)c(COc2cnc(Nc3c(C)cccc3NC(=O)C=C)nc2)c1F
Show InChI InChI=1S/C23H22F2N4O4/c1-5-19(30)28-16-8-6-7-13(2)22(16)29-23-26-10-14(11-27-23)33-12-15-20(24)17(31-3)9-18(32-4)21(15)25/h5-11H,1,12H2,2-4H3,(H,28,30)(H,26,27,29)
n/an/a 3.50E+4n/an/an/an/an/an/a
WuXi AppTec (Shanghai) Co., Ltd.
Curated by ChEMBL
Assay Description
Concentration that inhibits the binding of radioligand, [3H]-ICS 205930, to 5-hydroxytryptamine 3 receptor from rat cortex
Bioorg Med Chem Lett 27: 2420-2423 (2017)
Article DOI: 10.1016/j.bmcl.2017.04.014
BindingDB Entry DOI: 10.7270/Q2M90BT6