BDBM50240660 7-Hydroxy-2-[2-(2-hydroxy-ethylamino)-ethyl]-5-[2-(2-hydroxy-ethylamino)-ethylamino]-2H-dibenzo[cd,g]indazol-6-one::CHEMBL83520
SMILES: OCCNCCNc1ccc2n(CCNCCO)nc3-c4cccc(O)c4C(=O)c1c23
InChI Key: InChIKey=YROQEQPFUCPDCP-UHFFFAOYSA-N
Data: 1 IC50
Activity Spreadsheet -- Enzyme Inhibition Constant Data from BindingDB
Found 1 hit for monomerid = 50240660
Trg + Lig
Ki
nM
ΔG°
kcal/mole
IC50
nM
Kd
nM
EC50/IC50
nM
koff
s-1
kon
M-1s-1
pHTemp
°C
Topoisomerase II alpha (HuTopoIIα)
(Homo sapiens (Human))
BDBM50240660
(7-Hydroxy-2-[2-(2-hydroxy-ethylamino)-ethyl]-5-[2-...)
Show SMILES OCCNCCNc1ccc2n(CCNCCO)nc3-c4cccc(O)c4C(=O)c1c23
Show InChI InChI=1S/C22H27N5O4/c28-12-9-23-6-7-25-15-4-5-16-20-19(15)22(31)18-14(2-1-3-17(18)30)21(20)26-27(16)11-8-24-10-13-29/h1-5,23-25,28-30H,6-13H2
n/an/a 7.30E+3n/an/an/an/an/an/a
University of Manitoba
Curated by ChEMBL
Assay Description
Inhibition of human topoisomerase 2alpha decantation activity
Bioorg Med Chem 16: 3959-68 (2008)
Article DOI: 10.1016/j.bmc.2008.01.033
BindingDB Entry DOI: 10.7270/Q2T72H7K