BDBM50240716 (S)-2-Amino-5-(N'-propyl-guanidino)-pentanoic acid::CHEMBL107528::N-omega-propyl-L-arginine::Nomega-propyl-L-arginine
SMILES: CCCNC(N)=NCCC[C@H](N)C(O)=O
InChI Key: InChIKey=AOMXURITGZJPKB-ZETCQYMHSA-N
Data: 2 KI  1 IC50
Activity Spreadsheet -- Enzyme Inhibition Constant Data from BindingDB
Found 3 hits for monomerid = 50240716
Trg + Lig
Ki
nM
ΔG°
kcal/mole
IC50
nM
Kd
nM
EC50/IC50
nM
koff
s-1
kon
M-1s-1
pHTemp
°C
Nitric-oxide synthase, brain
(Rattus norvegicus (rat))
BDBM50240716
((S)-2-Amino-5-(N'-propyl-guanidino)-pentanoic acid...)
Show SMILES CCCNC(N)=NCCC[C@H](N)C(O)=O |r,w:6.6|
Show InChI InChI=1S/C9H20N4O2/c1-2-5-12-9(11)13-6-3-4-7(10)8(14)15/h7H,2-6,10H2,1H3,(H,14,15)(H3,11,12,13)/t7-/m0/s1
550n/an/an/an/an/an/an/an/a
Northwestern University
Curated by ChEMBL
Assay Description
Inhibition of rat nNOS
J Med Chem 56: 3121-47 (2013)
Article DOI: 10.1021/jm3015926
BindingDB Entry DOI: 10.7270/Q23T9JKG
Dimethylarginine dimethylaminohydrolase 1 (DDAH)
(Homo sapiens (Human))
BDBM50240716
((S)-2-Amino-5-(N'-propyl-guanidino)-pentanoic acid...)
Show SMILES CCCNC(N)=NCCC[C@H](N)C(O)=O |r,w:6.6|
Show InChI InChI=1S/C9H20N4O2/c1-2-5-12-9(11)13-6-3-4-7(10)8(14)15/h7H,2-6,10H2,1H3,(H,14,15)(H3,11,12,13)/t7-/m0/s1
9.00E+4n/an/an/an/an/an/an/an/a
Christian-Albrechts-University of Kiel
Curated by ChEMBL
Assay Description
Inhibition of human DDAH1 by plate-reader assay
Bioorg Med Chem 16: 10205-9 (2008)
Article DOI: 10.1016/j.bmc.2008.10.058
BindingDB Entry DOI: 10.7270/Q23F4PG3
3D
3D Structure (docked)
Dimethylarginine dimethylaminohydrolase 1 (DDAH)
(Homo sapiens (Human))
BDBM50240716
((S)-2-Amino-5-(N'-propyl-guanidino)-pentanoic acid...)
Show SMILES CCCNC(N)=NCCC[C@H](N)C(O)=O |r,w:6.6|
Show InChI InChI=1S/C9H20N4O2/c1-2-5-12-9(11)13-6-3-4-7(10)8(14)15/h7H,2-6,10H2,1H3,(H,14,15)(H3,11,12,13)/t7-/m0/s1
n/an/a 2.83E+5n/an/an/an/an/an/a
Christian-Albrechts-University of Kiel
Curated by ChEMBL
Assay Description
Inhibition of human DDAH1 by plate-reader assay
Bioorg Med Chem 16: 10205-9 (2008)
Article DOI: 10.1016/j.bmc.2008.10.058
BindingDB Entry DOI: 10.7270/Q23F4PG3
3D
3D Structure (docked)