BDBM50240870 CHEMBL4068259
SMILES: Nc1cccc(c1)-c1cc(nc(c1)C(O)=O)C(O)=O
InChI Key: InChIKey=FXWFQAQXUDVIOS-UHFFFAOYSA-N
Data: 2 IC50
Activity Spreadsheet -- Enzyme Inhibition Constant Data from BindingDB
Found 2 hits for monomerid = 50240870
Trg + Lig
Ki
nM
ΔG°
kcal/mole
IC50
nM
Kd
nM
EC50/IC50
nM
koff
s-1
kon
M-1s-1
pHTemp
°C
Metallo-beta-lactamase VIM-2 (VIM-2)
(Pseudomonas aeruginosa (g-Proteobacteria))
BDBM50240870
(CHEMBL4068259)
Show SMILES Nc1cccc(c1)-c1cc(nc(c1)C(O)=O)C(O)=O
Show InChI InChI=1S/C13H10N2O4/c14-9-3-1-2-7(4-9)8-5-10(12(16)17)15-11(6-8)13(18)19/h1-6H,14H2,(H,16,17)(H,18,19)
n/an/a 210n/an/an/an/an/an/a
University of California at San Diego
Curated by ChEMBL
Assay Description
Binding affinity at 5-hydroxytryptamine 1A receptor by the displacement of [3H]8-OH-DPAT in rat brain.
J Med Chem 60: 7267-7283 (2017)
Article DOI: 10.1021/acs.jmedchem.7b00407
BindingDB Entry DOI: 10.7270/Q2P27185
Metallo-beta-lactamase type 2
(Serratia marcescens)
BDBM50240870
(CHEMBL4068259)
Show SMILES Nc1cccc(c1)-c1cc(nc(c1)C(O)=O)C(O)=O
Show InChI InChI=1S/C13H10N2O4/c14-9-3-1-2-7(4-9)8-5-10(12(16)17)15-11(6-8)13(18)19/h1-6H,14H2,(H,16,17)(H,18,19)
n/an/a 240n/an/an/an/an/an/a
University of California at San Diego
Curated by ChEMBL
Assay Description
Inhibition of Serratia marcescens IMP1 expressed in Escherichia coli BL21(DE3) using chromacef as substrate preincubated for 10 mins followed by subs...
J Med Chem 60: 7267-7283 (2017)
Article DOI: 10.1021/acs.jmedchem.7b00407
BindingDB Entry DOI: 10.7270/Q2P27185