BDBM50240892 (-)-epiafzelechin::(2R,3R)-2-(4-Hydroxy-phenyl)-chroman-3,5,7-triol::CHEMBL159303
SMILES: O[C@@H]1Cc2c(O)cc(O)cc2O[C@@H]1c1ccc(O)cc1
InChI Key: InChIKey=RSYUFYQTACJFML-UKRRQHHQSA-N
Data: 3 IC50
Activity Spreadsheet -- Enzyme Inhibition Constant Data from BindingDB
Found 3 hits for monomerid = 50240892
Trg + Lig
Ki
nM
ΔG°
kcal/mole
IC50
nM
Kd
nM
EC50/IC50
nM
koff
s-1
kon
M-1s-1
pHTemp
°C
Cyclooxygenase-1 (COX-1)
(Homo sapiens (Human))
BDBM50240892
((-)-epiafzelechin | (2R,3R)-2-(4-Hydroxy-phenyl)-c...)
Show SMILES O[C@@H]1Cc2c(O)cc(O)cc2O[C@@H]1c1ccc(O)cc1 |r|
Show InChI InChI=1S/C15H14O5/c16-9-3-1-8(2-4-9)15-13(19)7-11-12(18)5-10(17)6-14(11)20-15/h1-6,13,15-19H,7H2/t13-,15-/m1/s1
n/an/a 1.50E+4n/an/an/an/an/an/a
Uppsala University
Curated by ChEMBL
Assay Description
Inhibition of COX1
J Nat Prod 68: 985-91 (2005)
Article DOI: 10.1021/np049655u
BindingDB Entry DOI: 10.7270/Q27S7PN5
Cyclooxygenase
(Homo sapiens (Human))
BDBM50240892
((-)-epiafzelechin | (2R,3R)-2-(4-Hydroxy-phenyl)-c...)
Show SMILES O[C@@H]1Cc2c(O)cc(O)cc2O[C@@H]1c1ccc(O)cc1 |r|
Show InChI InChI=1S/C15H14O5/c16-9-3-1-8(2-4-9)15-13(19)7-11-12(18)5-10(17)6-14(11)20-15/h1-6,13,15-19H,7H2/t13-,15-/m1/s1
NCI pathway
Reactome pathway
n/an/a 6.97E+4n/an/an/an/an/an/a
University of Illinois at Chicago
Curated by ChEMBL
Assay Description
Inhibition of COX2
J Nat Prod 65: 163-9 (2002)
BindingDB Entry DOI: 10.7270/Q2J38TGV
Cyclooxygenase-1 (COX-1)
(Homo sapiens (Human))
BDBM50240892
((-)-epiafzelechin | (2R,3R)-2-(4-Hydroxy-phenyl)-c...)
Show SMILES O[C@@H]1Cc2c(O)cc(O)cc2O[C@@H]1c1ccc(O)cc1 |r|
Show InChI InChI=1S/C15H14O5/c16-9-3-1-8(2-4-9)15-13(19)7-11-12(18)5-10(17)6-14(11)20-15/h1-6,13,15-19H,7H2/t13-,15-/m1/s1
n/an/a 6.40E+3n/an/an/an/an/an/a
University of Illinois at Chicago
Curated by ChEMBL
Assay Description
Inhibition of COX1
J Nat Prod 65: 163-9 (2002)
BindingDB Entry DOI: 10.7270/Q2J38TGV