BDBM50240962 Benzo[b]thiophene-2-carboxylic acid ((S)-1-{(R)-1-[4-(3-dimethylamino-propoxy)-benzyl]-pyrrolidin-3-ylcarbamoyl}-3-methyl-butyl)-amide::CHEMBL190533::N-((S)-1-((S)-1-(4-(3-(dimethylamino)propoxy)benzyl)pyrrolidin-3-ylamino)-4-methyl-1-oxopentan-2-yl)benzo[b]thiophene-2-carboxamide::SB-328872
SMILES: CC(C)C[C@H](NC(=O)c1cc2ccccc2s1)C(=O)N[C@H]1CCN(Cc2ccc(OCCCN(C)C)cc2)C1
InChI Key: InChIKey=HLMWNBIZKQIDFC-BDYUSTAISA-N
Data: 1 KI  1 IC50
Activity Spreadsheet -- Enzyme Inhibition Constant Data from BindingDB
Found 2 hits for monomerid = 50240962
Trg + Lig
Ki
nM
ΔG°
kcal/mole
IC50
nM
Kd
nM
EC50/IC50
nM
koff
s-1
kon
M-1s-1
pHTemp
°C
Urotensin II receptor
(Homo sapiens (Human))
BDBM50240962
(Benzo[b]thiophene-2-carboxylic acid ((S)-1-{(R)-1-...)
Show SMILES CC(C)C[C@H](NC(=O)c1cc2ccccc2s1)C(=O)N[C@H]1CCN(Cc2ccc(OCCCN(C)C)cc2)C1 |r|
Show InChI InChI=1S/C31H42N4O3S/c1-22(2)18-27(33-31(37)29-19-24-8-5-6-9-28(24)39-29)30(36)32-25-14-16-35(21-25)20-23-10-12-26(13-11-23)38-17-7-15-34(3)4/h5-6,8-13,19,22,25,27H,7,14-18,20-21H2,1-4H3,(H,32,36)(H,33,37)/t25-,27-/m0/s1
Reactome pathway
110n/an/an/an/an/an/an/an/a
GlaxoSmithKline
Curated by ChEMBL
Assay Description
Antagonist activity at human recombinant urotensin 2 receptor expressed in HEK293 cells assessed as inhibition of urotensin 2-induced calcium mobiliz...
Bioorg Med Chem Lett 18: 3950-4 (2008)
Article DOI: 10.1016/j.bmcl.2008.06.019
BindingDB Entry DOI: 10.7270/Q2FT8KTR
Urotensin II receptor
(Homo sapiens (Human))
BDBM50240962
(Benzo[b]thiophene-2-carboxylic acid ((S)-1-{(R)-1-...)
Show SMILES CC(C)C[C@H](NC(=O)c1cc2ccccc2s1)C(=O)N[C@H]1CCN(Cc2ccc(OCCCN(C)C)cc2)C1 |r|
Show InChI InChI=1S/C31H42N4O3S/c1-22(2)18-27(33-31(37)29-19-24-8-5-6-9-28(24)39-29)30(36)32-25-14-16-35(21-25)20-23-10-12-26(13-11-23)38-17-7-15-34(3)4/h5-6,8-13,19,22,25,27H,7,14-18,20-21H2,1-4H3,(H,32,36)(H,33,37)/t25-,27-/m0/s1
Reactome pathway
n/an/a 631n/an/an/an/an/an/a
GlaxoSmithKline
Curated by ChEMBL
Assay Description
Inhibition of hU-II-mediated [Ca2+]i mobilization in HEK293 cells expressing human recombinant Urotensin 2 receptor in FLIPR assay
Bioorg Med Chem Lett 15: 3229-32 (2005)
Article DOI: 10.1016/j.bmcl.2005.04.074
BindingDB Entry DOI: 10.7270/Q2ZS2XSG