BDBM50240977 CHEMBL4071150
SMILES: Cc1cc(N)ncc1-c1nc(nc(n1)N1CCOCC1)N1CCOCC1
InChI Key: InChIKey=NUKVTPRZKNCJIW-UHFFFAOYSA-N
Data: 2 KI  1 IC50
Activity Spreadsheet -- Enzyme Inhibition Constant Data from BindingDB
Found 3 hits for monomerid = 50240977
Trg + Lig
Ki
nM
ΔG°
kcal/mole
IC50
nM
Kd
nM
EC50/IC50
nM
koff
s-1
kon
M-1s-1
pHTemp
°C
p110α/p85α
(Homo sapiens (Human))
BDBM50240977
(CHEMBL4071150)
Show SMILES Cc1cc(N)ncc1-c1nc(nc(n1)N1CCOCC1)N1CCOCC1
Show InChI InChI=1S/C17H23N7O2/c1-12-10-14(18)19-11-13(12)15-20-16(23-2-6-25-7-3-23)22-17(21-15)24-4-8-26-9-5-24/h10-11H,2-9H2,1H3,(H2,18,19)
61n/an/an/an/an/an/an/an/a
University of Basel
Curated by ChEMBL
Assay Description
Inhibition of human N-terminal His6-tagged PI3K p110alpha/p85alpha expressed in baculovirus expression system after 1 hr using AlexaFluor647-labeled ...
J Med Chem 60: 7524-7538 (2017)
Article DOI: 10.1021/acs.jmedchem.7b00930
BindingDB Entry DOI: 10.7270/Q2WM1GKP
Serine/threonine-protein kinase mTOR
(Homo sapiens (Human))
BDBM50240977
(CHEMBL4071150)
Show SMILES Cc1cc(N)ncc1-c1nc(nc(n1)N1CCOCC1)N1CCOCC1
Show InChI InChI=1S/C17H23N7O2/c1-12-10-14(18)19-11-13(12)15-20-16(23-2-6-25-7-3-23)22-17(21-15)24-4-8-26-9-5-24/h10-11H,2-9H2,1H3,(H2,18,19)
NCI pathway
Reactome pathway
609n/an/an/an/an/an/an/an/a
University of Basel
Curated by ChEMBL
Assay Description
Inhibition of human C-terminal GST-tagged mTOR (1360 to 2549 residues) expressed in baculovirus expression system using after 1 hr AlexaFluor647-labe...
J Med Chem 60: 7524-7538 (2017)
Article DOI: 10.1021/acs.jmedchem.7b00930
BindingDB Entry DOI: 10.7270/Q2WM1GKP
Serine/threonine-protein kinase mTOR
(Homo sapiens (Human))
BDBM50240977
(CHEMBL4071150)
Show SMILES Cc1cc(N)ncc1-c1nc(nc(n1)N1CCOCC1)N1CCOCC1
Show InChI InChI=1S/C17H23N7O2/c1-12-10-14(18)19-11-13(12)15-20-16(23-2-6-25-7-3-23)22-17(21-15)24-4-8-26-9-5-24/h10-11H,2-9H2,1H3,(H2,18,19)
NCI pathway
Reactome pathway
n/an/a 939n/an/an/an/an/an/a
University of Basel
Curated by ChEMBL
Assay Description
Inhibition of mTOR in human A2058 cells assessed as reduction in phosphorylation of S6 at ser235/236 residues after 1 hr by in-cell Western method
J Med Chem 60: 7524-7538 (2017)
Article DOI: 10.1021/acs.jmedchem.7b00930
BindingDB Entry DOI: 10.7270/Q2WM1GKP