BDBM50241021 CHEMBL4071599
SMILES: OCC(CO)(CO)NC(=O)c1ccc2COc3cc(Nc4cc(NC(=O)c5cccs5)c(F)cc4F)ccc3C(=O)c2c1
InChI Key: InChIKey=DZTFCXQTDZXUHY-UHFFFAOYSA-N
Data: 2 IC50
Activity Spreadsheet -- Enzyme Inhibition Constant Data from BindingDB
Found 2 hits for monomerid = 50241021
Trg + Lig
Ki
nM
ΔG°
kcal/mole
IC50
nM
Kd
nM
EC50/IC50
nM
koff
s-1
kon
M-1s-1
pHTemp
°C
Mitogen-activated protein kinase 14
(Homo sapiens (Human))
BDBM50241021
(CHEMBL4071599)
Show SMILES OCC(CO)(CO)NC(=O)c1ccc2COc3cc(Nc4cc(NC(=O)c5cccs5)c(F)cc4F)ccc3C(=O)c2c1
Show InChI InChI=1S/C30H25F2N3O7S/c31-21-10-22(32)24(34-29(41)26-2-1-7-43-26)11-23(21)33-18-5-6-19-25(9-18)42-12-17-4-3-16(8-20(17)27(19)39)28(40)35-30(13-36,14-37)15-38/h1-11,33,36-38H,12-15H2,(H,34,41)(H,35,40)
NCI pathway
Reactome pathway
n/an/a 107n/an/an/an/an/an/a
Eberhard-Karls-Universitaet Tuebingen
Curated by ChEMBL
Assay Description
Inhibition of P38 alpha MAPK in human whole blood assessed as reduction in TNF-alpha release after 10 mins by ELISA
J Med Chem 60: 8027-8054 (2017)
Article DOI: 10.1021/acs.jmedchem.7b00745
BindingDB Entry DOI: 10.7270/Q2RV0QVZ
Mitogen-activated protein kinase 14
(Homo sapiens (Human))
BDBM50241021
(CHEMBL4071599)
Show SMILES OCC(CO)(CO)NC(=O)c1ccc2COc3cc(Nc4cc(NC(=O)c5cccs5)c(F)cc4F)ccc3C(=O)c2c1
Show InChI InChI=1S/C30H25F2N3O7S/c31-21-10-22(32)24(34-29(41)26-2-1-7-43-26)11-23(21)33-18-5-6-19-25(9-18)42-12-17-4-3-16(8-20(17)27(19)39)28(40)35-30(13-36,14-37)15-38/h1-11,33,36-38H,12-15H2,(H,34,41)(H,35,40)
NCI pathway
Reactome pathway
n/an/a 3n/an/an/an/an/an/a
Eberhard-Karls-Universitaet Tuebingen
Curated by ChEMBL
Assay Description
Inhibition of P38 alpha MAPK (unknown origin) by ELISA
J Med Chem 60: 8027-8054 (2017)
Article DOI: 10.1021/acs.jmedchem.7b00745
BindingDB Entry DOI: 10.7270/Q2RV0QVZ