BDBM50241026 CHEMBL4069033
SMILES: Fc1ccc(Nc2ccc3c(OCc4ccc(cc4C3=O)C(=O)NCCN3CCOCC3)c2)cc1NC(=O)c1cccs1
InChI Key: InChIKey=ZHZOHMNWBVRIJH-UHFFFAOYSA-N
Data: 2 IC50  2 Kd
Activity Spreadsheet -- Enzyme Inhibition Constant Data from BindingDB
Found 4 hits for monomerid = 50241026
Trg + Lig
Ki
nM
ΔG°
kcal/mole
IC50
nM
Kd
nM
EC50/IC50
nM
koff
s-1
kon
M-1s-1
pHTemp
°C
Mitogen-activated protein kinase 14
(Homo sapiens (Human))
BDBM50241026
(CHEMBL4069033)
Show SMILES Fc1ccc(Nc2ccc3c(OCc4ccc(cc4C3=O)C(=O)NCCN3CCOCC3)c2)cc1NC(=O)c1cccs1
Show InChI InChI=1S/C32H29FN4O5S/c33-26-8-6-22(17-27(26)36-32(40)29-2-1-15-43-29)35-23-5-7-24-28(18-23)42-19-21-4-3-20(16-25(21)30(24)38)31(39)34-9-10-37-11-13-41-14-12-37/h1-8,15-18,35H,9-14,19H2,(H,34,39)(H,36,40)
NCI pathway
Reactome pathway
n/an/a 1.60n/an/an/an/an/an/a
Eberhard-Karls-Universitaet Tuebingen
Curated by ChEMBL
Assay Description
Inhibition of P38 alpha MAPK (unknown origin) by ELISA
J Med Chem 60: 8027-8054 (2017)
Article DOI: 10.1021/acs.jmedchem.7b00745
BindingDB Entry DOI: 10.7270/Q2RV0QVZ
Mitogen-activated protein kinase 14
(Homo sapiens (Human))
BDBM50241026
(CHEMBL4069033)
Show SMILES Fc1ccc(Nc2ccc3c(OCc4ccc(cc4C3=O)C(=O)NCCN3CCOCC3)c2)cc1NC(=O)c1cccs1
Show InChI InChI=1S/C32H29FN4O5S/c33-26-8-6-22(17-27(26)36-32(40)29-2-1-15-43-29)35-23-5-7-24-28(18-23)42-19-21-4-3-20(16-25(21)30(24)38)31(39)34-9-10-37-11-13-41-14-12-37/h1-8,15-18,35H,9-14,19H2,(H,34,39)(H,36,40)
NCI pathway
Reactome pathway
n/an/an/a 7.80n/an/an/an/an/a
Eberhard-Karls-Universitaet Tuebingen
Curated by ChEMBL
Assay Description
Binding affinity to wild type human biotin labelled p38 alpha (9 to 352 residues) expressed in sf21 insect cells SPR analysis
J Med Chem 60: 8027-8054 (2017)
Article DOI: 10.1021/acs.jmedchem.7b00745
BindingDB Entry DOI: 10.7270/Q2RV0QVZ
Mitogen-activated protein kinase 14
(Homo sapiens (Human))
BDBM50241026
(CHEMBL4069033)
Show SMILES Fc1ccc(Nc2ccc3c(OCc4ccc(cc4C3=O)C(=O)NCCN3CCOCC3)c2)cc1NC(=O)c1cccs1
Show InChI InChI=1S/C32H29FN4O5S/c33-26-8-6-22(17-27(26)36-32(40)29-2-1-15-43-29)35-23-5-7-24-28(18-23)42-19-21-4-3-20(16-25(21)30(24)38)31(39)34-9-10-37-11-13-41-14-12-37/h1-8,15-18,35H,9-14,19H2,(H,34,39)(H,36,40)
NCI pathway
Reactome pathway
n/an/a 192n/an/an/an/an/an/a
Eberhard-Karls-Universitaet Tuebingen
Curated by ChEMBL
Assay Description
Inhibition of P38 alpha MAPK in human whole blood assessed as reduction in TNF-alpha release after 10 mins by ELISA
J Med Chem 60: 8027-8054 (2017)
Article DOI: 10.1021/acs.jmedchem.7b00745
BindingDB Entry DOI: 10.7270/Q2RV0QVZ
Mitogen-activated protein kinase 14
(Homo sapiens (Human))
BDBM50241026
(CHEMBL4069033)
Show SMILES Fc1ccc(Nc2ccc3c(OCc4ccc(cc4C3=O)C(=O)NCCN3CCOCC3)c2)cc1NC(=O)c1cccs1
Show InChI InChI=1S/C32H29FN4O5S/c33-26-8-6-22(17-27(26)36-32(40)29-2-1-15-43-29)35-23-5-7-24-28(18-23)42-19-21-4-3-20(16-25(21)30(24)38)31(39)34-9-10-37-11-13-41-14-12-37/h1-8,15-18,35H,9-14,19H2,(H,34,39)(H,36,40)
NCI pathway
Reactome pathway
n/an/an/a 3.20n/an/an/an/an/a
Eberhard-Karls-Universitaet Tuebingen
Curated by ChEMBL
Assay Description
Binding affinity to wild type human biotin labelled p38 alpha (9 to 352 residues) expressed in sf21 insect cells assessed as dissociation rate consta...
J Med Chem 60: 8027-8054 (2017)
Article DOI: 10.1021/acs.jmedchem.7b00745
BindingDB Entry DOI: 10.7270/Q2RV0QVZ