BDBM50241039 CHEMBL4075277
SMILES: COC(=O)c1ccc2CCc3cc(Nc4ccc(F)c(NC(=O)c5cccs5)c4)ccc3C(=O)c2c1
InChI Key: InChIKey=ZXOKQBYLRUTKSA-UHFFFAOYSA-N
Data: 1 IC50
Activity Spreadsheet -- Enzyme Inhibition Constant Data from BindingDB
Found 1 hit for monomerid = 50241039
Trg + Lig
Ki
nM
ΔG°
kcal/mole
IC50
nM
Kd
nM
EC50/IC50
nM
koff
s-1
kon
M-1s-1
pHTemp
°C
Mitogen-activated protein kinase 14
(Homo sapiens (Human))
BDBM50241039
(CHEMBL4075277)
Show SMILES COC(=O)c1ccc2CCc3cc(Nc4ccc(F)c(NC(=O)c5cccs5)c4)ccc3C(=O)c2c1
Show InChI InChI=1S/C28H21FN2O4S/c1-35-28(34)18-7-5-16-4-6-17-13-19(8-10-21(17)26(32)22(16)14-18)30-20-9-11-23(29)24(15-20)31-27(33)25-3-2-12-36-25/h2-3,5,7-15,30H,4,6H2,1H3,(H,31,33)
NCI pathway
Reactome pathway
n/an/a 1.10n/an/an/an/an/an/a
Eberhard-Karls-Universitaet Tuebingen
Curated by ChEMBL
Assay Description
Inhibition of P38 alpha MAPK (unknown origin) by ELISA
J Med Chem 60: 8027-8054 (2017)
Article DOI: 10.1021/acs.jmedchem.7b00745
BindingDB Entry DOI: 10.7270/Q2RV0QVZ