BDBM50241058 CHEMBL4104440
SMILES: CNC(=O)c1ccc2CCc3cc(Nc4cc(NC(=O)c5ccc(cc5)C(F)(F)F)c(F)cc4F)ccc3C(=O)c2c1
InChI Key: InChIKey=SRAZYCJTZIEEEQ-UHFFFAOYSA-N
Data: 1 IC50
Activity Spreadsheet -- Enzyme Inhibition Constant Data from BindingDB
Found 1 hit for monomerid = 50241058
Trg + Lig
Ki
nM
ΔG°
kcal/mole
IC50
nM
Kd
nM
EC50/IC50
nM
koff
s-1
kon
M-1s-1
pHTemp
°C
Mitogen-activated protein kinase 14
(Homo sapiens (Human))
BDBM50241058
(CHEMBL4104440)
Show SMILES CNC(=O)c1ccc2CCc3cc(Nc4cc(NC(=O)c5ccc(cc5)C(F)(F)F)c(F)cc4F)ccc3C(=O)c2c1
Show InChI InChI=1S/C31H22F5N3O3/c1-37-29(41)19-5-3-16-2-4-18-12-21(10-11-22(18)28(40)23(16)13-19)38-26-15-27(25(33)14-24(26)32)39-30(42)17-6-8-20(9-7-17)31(34,35)36/h3,5-15,38H,2,4H2,1H3,(H,37,41)(H,39,42)
NCI pathway
Reactome pathway
n/an/a 0.200n/an/an/an/an/an/a
Eberhard-Karls-Universitaet Tuebingen
Curated by ChEMBL
Assay Description
Inhibition of P38 alpha MAPK (unknown origin) by ELISA
J Med Chem 60: 8027-8054 (2017)
Article DOI: 10.1021/acs.jmedchem.7b00745
BindingDB Entry DOI: 10.7270/Q2RV0QVZ