BDBM50241059 CHEMBL4069496
SMILES: CNC(=O)c1ccc2CCc3cc(Nc4cc(NC(=O)c5cccc(OC)c5)c(F)cc4F)ccc3C(=O)c2c1
InChI Key: InChIKey=BBIZXFCENHJOBL-UHFFFAOYSA-N
Data: 1 IC50
Activity Spreadsheet -- Enzyme Inhibition Constant Data from BindingDB
Found 1 hit for monomerid = 50241059
Trg + Lig
Ki
nM
ΔG°
kcal/mole
IC50
nM
Kd
nM
EC50/IC50
nM
koff
s-1
kon
M-1s-1
pHTemp
°C
Mitogen-activated protein kinase 14
(Homo sapiens (Human))
BDBM50241059
(CHEMBL4069496)
Show SMILES CNC(=O)c1ccc2CCc3cc(Nc4cc(NC(=O)c5cccc(OC)c5)c(F)cc4F)ccc3C(=O)c2c1
Show InChI InChI=1S/C31H25F2N3O4/c1-34-30(38)20-9-7-17-6-8-18-12-21(10-11-23(18)29(37)24(17)14-20)35-27-16-28(26(33)15-25(27)32)36-31(39)19-4-3-5-22(13-19)40-2/h3-5,7,9-16,35H,6,8H2,1-2H3,(H,34,38)(H,36,39)
NCI pathway
Reactome pathway
n/an/a 0.200n/an/an/an/an/an/a
Eberhard-Karls-Universitaet Tuebingen
Curated by ChEMBL
Assay Description
Inhibition of P38 alpha MAPK (unknown origin) by ELISA
J Med Chem 60: 8027-8054 (2017)
Article DOI: 10.1021/acs.jmedchem.7b00745
BindingDB Entry DOI: 10.7270/Q2RV0QVZ