BDBM50241075 CHEMBL4073776
SMILES: OCCNC(=O)c1ccc2COc3cc(Nc4ccc(F)c(NC(=O)c5cccs5)c4)ccc3C(=O)c2c1
InChI Key: InChIKey=DZWQEMSZOBTNNH-UHFFFAOYSA-N
Data: 1 IC50
Activity Spreadsheet -- Enzyme Inhibition Constant Data from BindingDB
Found 1 hit for monomerid = 50241075
Trg + Lig
Ki
nM
ΔG°
kcal/mole
IC50
nM
Kd
nM
EC50/IC50
nM
koff
s-1
kon
M-1s-1
pHTemp
°C
Mitogen-activated protein kinase 14
(Homo sapiens (Human))
BDBM50241075
(CHEMBL4073776)
Show SMILES OCCNC(=O)c1ccc2COc3cc(Nc4ccc(F)c(NC(=O)c5cccs5)c4)ccc3C(=O)c2c1
Show InChI InChI=1S/C28H22FN3O5S/c29-22-8-6-18(13-23(22)32-28(36)25-2-1-11-38-25)31-19-5-7-20-24(14-19)37-15-17-4-3-16(12-21(17)26(20)34)27(35)30-9-10-33/h1-8,11-14,31,33H,9-10,15H2,(H,30,35)(H,32,36)
NCI pathway
Reactome pathway
n/an/a 1.60n/an/an/an/an/an/a
Eberhard-Karls-Universitaet Tuebingen
Curated by ChEMBL
Assay Description
Inhibition of P38 alpha MAPK (unknown origin) by ELISA
J Med Chem 60: 8027-8054 (2017)
Article DOI: 10.1021/acs.jmedchem.7b00745
BindingDB Entry DOI: 10.7270/Q2RV0QVZ