BDBM50241197 CHEMBL4072209
SMILES: C[C@]1(O)CCN(C1)c1nc(cc(c1C#N)C(F)(F)F)N1CCN(CCO)CC1
InChI Key: InChIKey=WPDFRVRQLSZPIL-KRWDZBQOSA-N
Data: 1 IC50
Activity Spreadsheet -- Enzyme Inhibition Constant Data from BindingDB
Found 1 hit for monomerid = 50241197
Trg + Lig
Ki
nM
ΔG°
kcal/mole
IC50
nM
Kd
nM
EC50/IC50
nM
koff
s-1
kon
M-1s-1
pHTemp
°C
Ketohexokinase (KHK) Isoform C
(Homo sapiens (Human))
BDBM50241197
(CHEMBL4072209)
Show SMILES C[C@]1(O)CCN(C1)c1nc(cc(c1C#N)C(F)(F)F)N1CCN(CCO)CC1 |r|
Show InChI InChI=1S/C18H24F3N5O2/c1-17(28)2-3-26(12-17)16-13(11-22)14(18(19,20)21)10-15(23-16)25-6-4-24(5-7-25)8-9-27/h10,27-28H,2-9,12H2,1H3/t17-/m0/s1
n/an/a 1.03E+3n/an/an/an/an/an/a
Pfizer Inc.
Curated by ChEMBL
Assay Description
Inhibition of recombinant human N-terminal His-tagged KHK expressed in Escherichia coli BL21(DE3) using fructose as substrate incubated for 30 mins f...
J Med Chem 60: 7835-7849 (2017)
Article DOI: 10.1021/acs.jmedchem.7b00947
BindingDB Entry DOI: 10.7270/Q2H997CM