BDBM50241611 1, 3-dihydroxy-5-[14'-(3' ',5' '-dihydroxyphenyl)-cis-7'-tetradecenyl]benzene::CHEMBL455349
SMILES: Oc1cc(O)cc(CCCCCC\C=C/CCCCCCc2cc(O)cc(O)c2)c1
InChI Key: InChIKey=SVPVGQFYXVXBRQ-UPHRSURJSA-N
Data: 1 IC50
Activity Spreadsheet -- Enzyme Inhibition Constant Data from BindingDB
Found 1 hit for monomerid = 50241611
Trg + Lig
Ki
nM
ΔG°
kcal/mole
IC50
nM
Kd
nM
EC50/IC50
nM
koff
s-1
kon
M-1s-1
pHTemp
°C
DNA polymerase beta
(Rattus norvegicus)
BDBM50241611
(1, 3-dihydroxy-5-[14'-(3' ',5' '-dihydroxyphenyl)-...)
Show SMILES Oc1cc(O)cc(CCCCCC\C=C/CCCCCCc2cc(O)cc(O)c2)c1
Show InChI InChI=1S/C26H36O4/c27-23-15-21(16-24(28)19-23)13-11-9-7-5-3-1-2-4-6-8-10-12-14-22-17-25(29)20-26(30)18-22/h1-2,15-20,27-30H,3-14H2/b2-1-
Reactome pathway
n/an/a 6.50E+3n/an/an/an/an/an/a
University of Virginia
Curated by ChEMBL
Assay Description
Inhibition of rat DNA polymerase beta assessed as [3H]TTP incorporation after 60 mins by scintillation counting in presence of bovine serum albumin
J Nat Prod 62: 477-80 (1999)
Article DOI: 10.1021/np980522g
BindingDB Entry DOI: 10.7270/Q20Z731M