BDBM50241759 CHEMBL4094412
SMILES: Cl.CCCOc1ccc(Br)c2[C@@H](CN)OB(O)c12
InChI Key: InChIKey=LWGRYRMGIWLSOF-SBSPUUFOSA-N
Data: 1 IC50
Activity Spreadsheet -- Enzyme Inhibition Constant Data from BindingDB
Found 1 hit for monomerid = 50241759
Trg + Lig
Ki
nM
ΔG°
kcal/mole
IC50
nM
Kd
nM
EC50/IC50
nM
koff
s-1
kon
M-1s-1
pHTemp
°C
Leucine--tRNA ligase
(Mycobacterium tuberculosis (strain ATCC 25618 / H3...)
BDBM50241759
(CHEMBL4094412)
Show SMILES Cl.CCCOc1ccc(Br)c2[C@@H](CN)OB(O)c12 |r|
Show InChI InChI=1S/C11H15BBrNO3.ClH/c1-2-5-16-8-4-3-7(13)10-9(6-14)17-12(15)11(8)10;/h3-4,9,15H,2,5-6,14H2,1H3;1H/t9-;/m1./s1
n/an/a 240n/an/an/an/an/an/a
Anacor Pharmaceuticals, Inc.
Curated by ChEMBL
Assay Description
Inhibition of Mycobacterium tuberculosis H37Rv N-terminal 6His-tagged LeuRS expressed in Escherichia coli BL21(DE3) assessed as L-[14C]leucine incorp...
J Med Chem 60: 8011-8026 (2017)
Article DOI: 10.1021/acs.jmedchem.7b00631
BindingDB Entry DOI: 10.7270/Q2XD13TH