BDBM50241770 CHEMBL4061966
SMILES: Cl.NCC1OB(O)c2c1c(Cl)ccc2OCCO
InChI Key: InChIKey=FUOKBESTQMGROA-UHFFFAOYSA-N
Data: 1 IC50
Activity Spreadsheet -- Enzyme Inhibition Constant Data from BindingDB
Found 1 hit for monomerid = 50241770
Trg + Lig
Ki
nM
ΔG°
kcal/mole
IC50
nM
Kd
nM
EC50/IC50
nM
koff
s-1
kon
M-1s-1
pHTemp
°C
Leucine--tRNA ligase
(Mycobacterium tuberculosis (strain ATCC 25618 / H3...)
BDBM50241770
(CHEMBL4061966)
Show SMILES Cl.NCC1OB(O)c2c1c(Cl)ccc2OCCO
Show InChI InChI=1S/C10H13BClNO4.ClH/c12-6-1-2-7(16-4-3-14)10-9(6)8(5-13)17-11(10)15;/h1-2,8,14-15H,3-5,13H2;1H
n/an/a 240n/an/an/an/an/an/a
Anacor Pharmaceuticals, Inc.
Curated by ChEMBL
Assay Description
Inhibition of Mycobacterium tuberculosis H37Rv N-terminal 6His-tagged LeuRS expressed in Escherichia coli BL21(DE3) assessed as L-[14C]leucine incorp...
J Med Chem 60: 8011-8026 (2017)
Article DOI: 10.1021/acs.jmedchem.7b00631
BindingDB Entry DOI: 10.7270/Q2XD13TH