BDBM50241799 CHEMBL4096785
SMILES: Cl.CCCOc1cc2B(O)OC(CN)c2c(Cl)c1
InChI Key: InChIKey=BWBVTPRZIYALPA-UHFFFAOYSA-N
Data: 1 IC50
Activity Spreadsheet -- Enzyme Inhibition Constant Data from BindingDB
Found 1 hit for monomerid = 50241799
Trg + Lig
Ki
nM
ΔG°
kcal/mole
IC50
nM
Kd
nM
EC50/IC50
nM
koff
s-1
kon
M-1s-1
pHTemp
°C
Leucine--tRNA ligase
(Mycobacterium tuberculosis (strain ATCC 25618 / H3...)
BDBM50241799
(CHEMBL4096785)
Show SMILES Cl.CCCOc1cc2B(O)OC(CN)c2c(Cl)c1
Show InChI InChI=1S/C11H15BClNO3.ClH/c1-2-3-16-7-4-8-11(9(13)5-7)10(6-14)17-12(8)15;/h4-5,10,15H,2-3,6,14H2,1H3;1H
n/an/a 250n/an/an/an/an/an/a
Anacor Pharmaceuticals, Inc.
Curated by ChEMBL
Assay Description
Inhibition of Mycobacterium tuberculosis H37Rv N-terminal 6His-tagged LeuRS expressed in Escherichia coli BL21(DE3) assessed as L-[14C]leucine incorp...
J Med Chem 60: 8011-8026 (2017)
Article DOI: 10.1021/acs.jmedchem.7b00631
BindingDB Entry DOI: 10.7270/Q2XD13TH