BDBM50241816 CHEMBL4098452
SMILES: Oc1ccc2cc(C(=O)NCCCc3ccccc3O)c(=O)oc2c1
InChI Key: InChIKey=VFNPSKKBRLJDNM-UHFFFAOYSA-N
Data: 2 IC50
Activity Spreadsheet -- Enzyme Inhibition Constant Data from BindingDB
Found 2 hits for monomerid = 50241816
Trg + Lig
Ki
nM
ΔG°
kcal/mole
IC50
nM
Kd
nM
EC50/IC50
nM
koff
s-1
kon
M-1s-1
pHTemp
°C
Aldose reductase
(Homo sapiens (Human))
BDBM50241816
(CHEMBL4098452)
Show SMILES Oc1ccc2cc(C(=O)NCCCc3ccccc3O)c(=O)oc2c1
Show InChI InChI=1S/C19H17NO5/c21-14-8-7-13-10-15(19(24)25-17(13)11-14)18(23)20-9-3-5-12-4-1-2-6-16(12)22/h1-2,4,6-8,10-11,21-22H,3,5,9H2,(H,20,23)
n/an/a 220n/an/an/an/an/an/a
Gifu Pharmaceutical University
Curated by ChEMBL
Assay Description
Inhibition of recombinant human AKR1B1 using pyridine-3-aldehyde as substrate
J Med Chem 60: 8441-8455 (2017)
Article DOI: 10.1021/acs.jmedchem.7b00830
BindingDB Entry DOI: 10.7270/Q2NZ89S7
Aldo-keto reductase family member 1B10 (AKR1B10)
(Homo sapiens (Human))
BDBM50241816
(CHEMBL4098452)
Show SMILES Oc1ccc2cc(C(=O)NCCCc3ccccc3O)c(=O)oc2c1
Show InChI InChI=1S/C19H17NO5/c21-14-8-7-13-10-15(19(24)25-17(13)11-14)18(23)20-9-3-5-12-4-1-2-6-16(12)22/h1-2,4,6-8,10-11,21-22H,3,5,9H2,(H,20,23)
n/an/a 6.40n/an/an/an/an/an/a
Gifu Pharmaceutical University
Curated by ChEMBL
Assay Description
Inhibition of recombinant human AKR1B10 using pyridine-3-aldehyde as substrate
J Med Chem 60: 8441-8455 (2017)
Article DOI: 10.1021/acs.jmedchem.7b00830
BindingDB Entry DOI: 10.7270/Q2NZ89S7