null
SMILES: O=C(Nc1ccc(CN2CCOCC2)cc1)\C=C\c1cnccc1-c1ccc2[nH]cnc2c1
InChI Key: InChIKey=GHUGJYUFZCOUPW-XBXARRHUSA-N
Activity Spreadsheet -- Enzyme Inhibition Constant Data from BindingDB
Found 2 hits for monomerid = 50241879
Trg + Lig
Ki
nM
ΔG°
kcal/mole
IC50
nM
Kd
nM
EC50/IC50
nM
koff
s-1
kon
M-1s-1
pHTemp
°C
Cyclin-C
(Homo sapiens (Human))
BDBM50241879
(CHEMBL4082587)
Show SMILES O=C(Nc1ccc(CN2CCOCC2)cc1)\C=C\c1cnccc1-c1ccc2[nH]cnc2c1
Show InChI InChI=1S/C26H25N5O2/c32-26(30-22-5-1-19(2-6-22)17-31-11-13-33-14-12-31)8-4-21-16-27-10-9-23(21)20-3-7-24-25(15-20)29-18-28-24/h1-10,15-16,18H,11-14,17H2,(H,28,29)(H,30,32)/b8-4+
n/an/a 1.5n/an/an/an/an/an/a
Takeda Pharmaceutical Co., Ltd.
Curated by ChEMBL
Assay Description
Inhibition of kinase tracer 236 binding to full length N terminal GST-tagged human CDK8 (1 to 464 end residues) /CycC ( 1 to 283 end residues) expres...
Bioorg Med Chem 25: 3018-3033 (2017)
Article DOI: 10.1016/j.bmc.2017.03.049
BindingDB Entry DOI: 10.7270/Q24X59XW
Cyclin-dependent kinase 8
(Homo sapiens (Human))
BDBM50241879
(CHEMBL4082587)
Show SMILES O=C(Nc1ccc(CN2CCOCC2)cc1)\C=C\c1cnccc1-c1ccc2[nH]cnc2c1
Show InChI InChI=1S/C26H25N5O2/c32-26(30-22-5-1-19(2-6-22)17-31-11-13-33-14-12-31)8-4-21-16-27-10-9-23(21)20-3-7-24-25(15-20)29-18-28-24/h1-10,15-16,18H,11-14,17H2,(H,28,29)(H,30,32)/b8-4+
Reactome pathway
n/an/an/an/a 10n/an/an/an/a
Takeda Pharmaceutical Co., Ltd.
Curated by ChEMBL
Assay Description
Inhibition of CDK8 in human SW480 cells assessed as reduction in IFN-gamma induced STAT1 phosphorylation at Ser727 residues preincubated for 2 hrs fo...
Bioorg Med Chem 25: 3018-3033 (2017)
Article DOI: 10.1016/j.bmc.2017.03.049
BindingDB Entry DOI: 10.7270/Q24X59XW