BDBM50241937 (-)-dihydrocubebin::CHEMBL486597::dihydrocubebin
SMILES: OC[C@H](Cc1ccc2OCOc2c1)[C@H](CO)Cc1ccc2OCOc2c1
InChI Key: InChIKey=JKCVMTYNARDGET-HOTGVXAUSA-N
Data: 1 KI  2 IC50
Activity Spreadsheet -- Enzyme Inhibition Constant Data from BindingDB
Found 3 hits for monomerid = 50241937
Trg + Lig
Ki
nM
ΔG°
kcal/mole
IC50
nM
Kd
nM
EC50/IC50
nM
koff
s-1
kon
M-1s-1
pHTemp
°C
Cytochrome P450 3A4
(Homo sapiens (Human))
BDBM50241937
((-)-dihydrocubebin | CHEMBL486597 | dihydrocubebin)
Show SMILES OC[C@H](Cc1ccc2OCOc2c1)[C@H](CO)Cc1ccc2OCOc2c1 |r|
Show InChI InChI=1S/C20H22O6/c21-9-15(5-13-1-3-17-19(7-13)25-11-23-17)16(10-22)6-14-2-4-18-20(8-14)26-12-24-18/h1-4,7-8,15-16,21-22H,5-6,9-12H2/t15-,16-/m0/s1
Reactome pathway
142n/an/an/an/an/an/an/an/a
F. Hoffmann-La Roche Ltd.
Curated by ChEMBL
Assay Description
Mechanism based inhibition of human cytochrome P450 3A4 measured by (14C)formaldehyde production from (N-methyl-14C)-erythromycin
Curr Drug Metab 6: 413-54 (2005)
BindingDB Entry DOI: 10.7270/Q2VQ33X3
Cytochrome P450 2D6
(Homo sapiens (Human))
BDBM50241937
((-)-dihydrocubebin | CHEMBL486597 | dihydrocubebin)
Show SMILES OC[C@H](Cc1ccc2OCOc2c1)[C@H](CO)Cc1ccc2OCOc2c1 |r|
Show InChI InChI=1S/C20H22O6/c21-9-15(5-13-1-3-17-19(7-13)25-11-23-17)16(10-22)6-14-2-4-18-20(8-14)26-12-24-18/h1-4,7-8,15-16,21-22H,5-6,9-12H2/t15-,16-/m0/s1
n/an/a 1.75E+4n/an/an/an/an/an/a
Toyama Medical and Pharmaceutical University
Curated by ChEMBL
Assay Description
Inhibition of human liver microsome CYP2D6 in assessed as [14C]formaldehyde formation
J Nat Prod 68: 64-8 (2005)
Article DOI: 10.1021/np0401765
BindingDB Entry DOI: 10.7270/Q26M37Q4
Cytochrome P450 3A4
(Homo sapiens (Human))
BDBM50241937
((-)-dihydrocubebin | CHEMBL486597 | dihydrocubebin)
Show SMILES OC[C@H](Cc1ccc2OCOc2c1)[C@H](CO)Cc1ccc2OCOc2c1 |r|
Show InChI InChI=1S/C20H22O6/c21-9-15(5-13-1-3-17-19(7-13)25-11-23-17)16(10-22)6-14-2-4-18-20(8-14)26-12-24-18/h1-4,7-8,15-16,21-22H,5-6,9-12H2/t15-,16-/m0/s1
Reactome pathway
n/an/a 9.50E+3n/an/an/an/an/an/a
Toyama Medical and Pharmaceutical University
Curated by ChEMBL
Assay Description
Inhibition of human liver microsome CYP3A4 in assessed as [14C]formaldehyde formation
J Nat Prod 68: 64-8 (2005)
Article DOI: 10.1021/np0401765
BindingDB Entry DOI: 10.7270/Q26M37Q4