BDBM50242129 3-beta-acetoxy-2-alpha-hydroxyurs-12-en-28-oic acid::CHEMBL518143
SMILES: C[C@@H]1CC[C@@]2(CC[C@]3(C)C(=CC[C@@H]4[C@@]5(C)C[C@@H](O)[C@H](OC(C)=O)C(C)(C)[C@@H]5CC[C@@]34C)[C@@H]2[C@H]1C)C(O)=O
InChI Key: InChIKey=PCEBPJUHBOJBAJ-FXZBVTQXSA-N
Data: 1 IC50
Activity Spreadsheet -- Enzyme Inhibition Constant Data from BindingDB
Found 1 hit for monomerid = 50242129
Trg + Lig
Ki
nM
ΔG°
kcal/mole
IC50
nM
Kd
nM
EC50/IC50
nM
koff
s-1
kon
M-1s-1
pHTemp
°C
DNA polymerase beta
(Homo sapiens (Human))
BDBM50242129
(3-beta-acetoxy-2-alpha-hydroxyurs-12-en-28-oic aci...)
Show SMILES C[C@@H]1CC[C@@]2(CC[C@]3(C)C(=CC[C@@H]4[C@@]5(C)C[C@@H](O)[C@H](OC(C)=O)C(C)(C)[C@@H]5CC[C@@]34C)[C@@H]2[C@H]1C)C(O)=O |r,c:9|
Show InChI InChI=1S/C32H50O5/c1-18-11-14-32(27(35)36)16-15-30(7)21(25(32)19(18)2)9-10-24-29(6)17-22(34)26(37-20(3)33)28(4,5)23(29)12-13-31(24,30)8/h9,18-19,22-26,34H,10-17H2,1-8H3,(H,35,36)/t18-,19+,22-,23+,24-,25+,26+,29+,30-,31-,32+/m1/s1
Reactome pathway
n/an/a 2.15E+4n/an/an/an/an/an/a
Virginia Polytechnic Institute and State University
Curated by ChEMBL
Assay Description
Inhibition of DNA polymerase beta (unknown origin) lyase activity
J Nat Prod 67: 899-901 (2004)
Article DOI: 10.1021/np030531b
BindingDB Entry DOI: 10.7270/Q2KH0N38