BDBM50242382 CHEMBL4059612
SMILES: Cc1nc2c(ncnc2n1Cc1ccc(Br)cc1)N1CCOCC1
InChI Key: InChIKey=IRDCNBGZRDOIIL-UHFFFAOYSA-N
Data: 1 IC50
Activity Spreadsheet -- Enzyme Inhibition Constant Data from BindingDB
Found 1 hit for monomerid = 50242382
Trg + Lig
Ki
nM
ΔG°
kcal/mole
IC50
nM
Kd
nM
EC50/IC50
nM
koff
s-1
kon
M-1s-1
pHTemp
°C
cAMP and cAMP-inhibited cGMP 3',5'-cyclic phosphodiesterase 10A
(Homo sapiens (Human))
BDBM50242382
(CHEMBL4059612)
Show SMILES Cc1nc2c(ncnc2n1Cc1ccc(Br)cc1)N1CCOCC1
Show InChI InChI=1S/C17H18BrN5O/c1-12-21-15-16(22-6-8-24-9-7-22)19-11-20-17(15)23(12)10-13-2-4-14(18)5-3-13/h2-5,11H,6-10H2,1H3
Reactome pathway
n/an/a 327n/an/an/an/an/an/a
Nanchang University
Curated by ChEMBL
Assay Description
Inhibition of recombinant human N-terminal GST-tagged PDE10A1 (2 to 789 residues) expressed in baculovirus infected Sf9 cells using fluorescein-label...
Bioorg Med Chem 25: 3315-3329 (2017)
Article DOI: 10.1016/j.bmc.2017.04.019
BindingDB Entry DOI: 10.7270/Q25X2CB8