null
SMILES: CC(C)(NCC(=O)N1C[C@@H](F)C[C@H]1C#N)c1ccccn1
InChI Key: InChIKey=GSLSWBGMFHKOFM-RYUDHWBXSA-N
Activity Spreadsheet -- Enzyme Inhibition Constant Data from BindingDB
Found 1 hit for monomerid = 50242477
Trg + Lig
Ki
nM
ΔG°
kcal/mole
IC50
nM
Kd
nM
EC50/IC50
nM
koff
s-1
kon
M-1s-1
pHTemp
°C
Dipeptidyl peptidase 4
(Homo sapiens (Human))
BDBM50242477
((2S,4S)-4-Fluoro-1-[N-(1-methyl-1-pyridin-2-ylethy...)
Show SMILES CC(C)(NCC(=O)N1C[C@@H](F)C[C@H]1C#N)c1ccccn1 |r|
Show InChI InChI=1S/C15H19FN4O/c1-15(2,13-5-3-4-6-18-13)19-9-14(21)20-10-11(16)7-12(20)8-17/h3-6,11-12,19H,7,9-10H2,1-2H3/t11-,12-/m0/s1
Reactome pathway
n/an/a 22n/an/an/an/an/an/a
Taisho Pharmaceutical Co., Ltd
Curated by ChEMBL
Assay Description
Inhibition of DPP4 in human plasma by fluorescence assay
Bioorg Med Chem 16: 4093-106 (2008)
Article DOI: 10.1016/j.bmc.2008.01.016
BindingDB Entry DOI: 10.7270/Q27H1KGN