BDBM50242496 (2S,4S)-4-Fluoro-1-(N-isopropylglycyl)pyrrolidine-2-carbonitrile::CHEMBL472102
SMILES: CC(C)NCC(=O)N1C[C@@H](F)C[C@H]1C#N
InChI Key: InChIKey=GPSRJEJHWPGDIR-IUCAKERBSA-N
Data: 1 IC50
Activity Spreadsheet -- Enzyme Inhibition Constant Data from BindingDB
Found 1 hit for monomerid = 50242496
Trg + Lig
Ki
nM
ΔG°
kcal/mole
IC50
nM
Kd
nM
EC50/IC50
nM
koff
s-1
kon
M-1s-1
pHTemp
°C
Dipeptidyl peptidase 4
(Homo sapiens (Human))
BDBM50242496
((2S,4S)-4-Fluoro-1-(N-isopropylglycyl)pyrrolidine-...)
Show SMILES CC(C)NCC(=O)N1C[C@@H](F)C[C@H]1C#N |r|
Show InChI InChI=1S/C10H16FN3O/c1-7(2)13-5-10(15)14-6-8(11)3-9(14)4-12/h7-9,13H,3,5-6H2,1-2H3/t8-,9-/m0/s1
Reactome pathway
n/an/a 7.80n/an/an/an/an/an/a
Taisho Pharmaceutical Co., Ltd
Curated by ChEMBL
Assay Description
Inhibition of DPP4 in human plasma by fluorescence assay
Bioorg Med Chem 16: 4093-106 (2008)
Article DOI: 10.1016/j.bmc.2008.01.016
BindingDB Entry DOI: 10.7270/Q27H1KGN