null
SMILES: C[C@H](c1ccccc1)n1c2ccc(cc2oc1=O)S(=O)(=O)Nc1ncns1
InChI Key: InChIKey=UWQNWXMVIFOIBT-LLVKDONJSA-N
Activity Spreadsheet -- Enzyme Inhibition Constant Data from BindingDB
Found 1 hit for monomerid = 50242508
Trg + Lig
Ki
nM
ΔG°
kcal/mole
IC50
nM
Kd
nM
EC50/IC50
nM
koff
s-1
kon
M-1s-1
pHTemp
°C
Sodium channel protein type 9 subunit alpha
(Homo sapiens (Human))
BDBM50242508
(CHEMBL4084948)
Show SMILES C[C@H](c1ccccc1)n1c2ccc(cc2oc1=O)S(=O)(=O)Nc1ncns1 |r|
Show InChI InChI=1S/C17H14N4O4S2/c1-11(12-5-3-2-4-6-12)21-14-8-7-13(9-15(14)25-17(21)22)27(23,24)20-16-18-10-19-26-16/h2-11H,1H3,(H,18,19,20)/t11-/m1/s1
n/an/a 74n/an/an/an/an/an/a
Merck& Co.
Curated by ChEMBL
Assay Description
Inhibition of 50% inactivated human Nav1.7alpha expressed in HEK293 cells incubated for 5 mins measured at 10 secs interval by PatchXpress automated ...
Bioorg Med Chem Lett 27: 2683-2688 (2017)
Article DOI: 10.1016/j.bmcl.2017.04.040
BindingDB Entry DOI: 10.7270/Q2SN0CD7