null
SMILES: CC(C)(CNC(=O)c1ccc2OCCc2c1)NCC(=O)N1C[C@@H](F)C[C@H]1C#N
InChI Key: InChIKey=GQVZTDRMUNZQJM-HOTGVXAUSA-N
Activity Spreadsheet -- Enzyme Inhibition Constant Data from BindingDB
Found 1 hit for monomerid = 50242593
Trg + Lig
Ki
nM
ΔG°
kcal/mole
IC50
nM
Kd
nM
EC50/IC50
nM
koff
s-1
kon
M-1s-1
pHTemp
°C
Dipeptidyl peptidase 4
(Homo sapiens (Human))
BDBM50242593
(CHEMBL488036 | N-[2-({2-[(2S,4S)-2-Cyano-4-fluorop...)
Show SMILES CC(C)(CNC(=O)c1ccc2OCCc2c1)NCC(=O)N1C[C@@H](F)C[C@H]1C#N |r|
Show InChI InChI=1S/C20H25FN4O3/c1-20(2,24-10-18(26)25-11-15(21)8-16(25)9-22)12-23-19(27)14-3-4-17-13(7-14)5-6-28-17/h3-4,7,15-16,24H,5-6,8,10-12H2,1-2H3,(H,23,27)/t15-,16-/m0/s1
Reactome pathway
n/an/a 2.90n/an/an/an/an/an/a
Taisho Pharmaceutical Co., Ltd
Curated by ChEMBL
Assay Description
Inhibition of DPP4 in human plasma by fluorescence assay
Bioorg Med Chem 16: 4093-106 (2008)
Article DOI: 10.1016/j.bmc.2008.01.016
BindingDB Entry DOI: 10.7270/Q27H1KGN