BDBM50242596 CHEMBL487861::N-[2-({2-[(2S,4S)-2-Cyano-4-fluoropyrrolidin-1-yl]-2-oxoethyl}amino)-2-methylpropyl]-2,2-dimethylpropanamide
SMILES: CC(C)(C)C(=O)NCC(C)(C)NCC(=O)N1C[C@@H](F)C[C@H]1C#N
InChI Key: InChIKey=VEZXESBJSKUGOR-RYUDHWBXSA-N
Data: 1 IC50
Activity Spreadsheet -- Enzyme Inhibition Constant Data from BindingDB
Found 1 hit for monomerid = 50242596
Trg + Lig
Ki
nM
ΔG°
kcal/mole
IC50
nM
Kd
nM
EC50/IC50
nM
koff
s-1
kon
M-1s-1
pHTemp
°C
Dipeptidyl peptidase 4
(Homo sapiens (Human))
BDBM50242596
(CHEMBL487861 | N-[2-({2-[(2S,4S)-2-Cyano-4-fluorop...)
Show SMILES CC(C)(C)C(=O)NCC(C)(C)NCC(=O)N1C[C@@H](F)C[C@H]1C#N |r|
Show InChI InChI=1S/C16H27FN4O2/c1-15(2,3)14(23)19-10-16(4,5)20-8-13(22)21-9-11(17)6-12(21)7-18/h11-12,20H,6,8-10H2,1-5H3,(H,19,23)/t11-,12-/m0/s1
Reactome pathway
n/an/a 5.80n/an/an/an/an/an/a
Taisho Pharmaceutical Co., Ltd
Curated by ChEMBL
Assay Description
Inhibition of DPP4 in human plasma by fluorescence assay
Bioorg Med Chem 16: 4093-106 (2008)
Article DOI: 10.1016/j.bmc.2008.01.016
BindingDB Entry DOI: 10.7270/Q27H1KGN