BDBM50242628 CHEMBL450985::N-dodecyldeoxynojirimycin
SMILES: CCCCCCCCCCCCN1C[C@H](O)[C@@H](O)[C@H](O)[C@H]1CO
InChI Key: InChIKey=TYXAKMAAZJJHCB-XMTFNYHQSA-N
Data: 1 IC50
Activity Spreadsheet -- Enzyme Inhibition Constant Data from BindingDB
Found 1 hit for monomerid = 50242628
Trg + Lig
Ki
nM
ΔG°
kcal/mole
IC50
nM
Kd
nM
EC50/IC50
nM
koff
s-1
kon
M-1s-1
pHTemp
°C
Beta-glucosidase
(Homo sapiens (Human))
BDBM50242628
(CHEMBL450985 | N-dodecyldeoxynojirimycin)
Show SMILES CCCCCCCCCCCCN1C[C@H](O)[C@@H](O)[C@H](O)[C@H]1CO |r|
Show InChI InChI=1S/C18H37NO4/c1-2-3-4-5-6-7-8-9-10-11-12-19-13-16(21)18(23)17(22)15(19)14-20/h15-18,20-23H,2-14H2,1H3/t15-,16+,17-,18-/m1/s1
Reactome pathway
n/an/a 2n/an/an/an/an/an/a
University of Oxford
Curated by ChEMBL
Assay Description
Inhibition of bile acid beta-glucosidase activity of human liver GBA2
J Biol Chem 282: 32655-64 (2007)
Article DOI: 10.1074/jbc.M702387200
BindingDB Entry DOI: 10.7270/Q2QJ7H2D