BDBM50242648 2-(3-fluoro-4-hydroxyphenyl)-7-(2-fluorovinyl)benzo[d]oxazol-5-ol::CHEMBL486225
SMILES: Oc1cc(\C=C\F)c2oc(nc2c1)-c1ccc(O)c(F)c1
InChI Key: InChIKey=GORQLKWDZKXABD-ONEGZZNKSA-N
Data: 1 IC50
Activity Spreadsheet -- Enzyme Inhibition Constant Data from BindingDB
Found 1 hit for monomerid = 50242648
Trg + Lig
Ki
nM
ΔG°
kcal/mole
IC50
nM
Kd
nM
EC50/IC50
nM
koff
s-1
kon
M-1s-1
pHTemp
°C
Estrogen receptor beta
(Homo sapiens (Human))
BDBM50242648
(2-(3-fluoro-4-hydroxyphenyl)-7-(2-fluorovinyl)benz...)
Show SMILES Oc1cc(\C=C\F)c2oc(nc2c1)-c1ccc(O)c(F)c1
Show InChI InChI=1S/C15H9F2NO3/c16-4-3-8-5-10(19)7-12-14(8)21-15(18-12)9-1-2-13(20)11(17)6-9/h1-7,19-20H/b4-3+
n/an/a 3.20n/an/an/an/an/an/a
Yantai University
Curated by ChEMBL
Assay Description
Binding affinity to ERbeta (unknown origin)
Eur J Med Chem 43: 43-52 (2008)
Article DOI: 10.1016/j.ejmech.2007.03.002
BindingDB Entry DOI: 10.7270/Q2WD40BT