BDBM50242695 CHEMBL4068395::US9932350, 2-6
SMILES: CN(C)[C@H]1CC[C@@H](CC1)Nc1ncnc2ccc(Br)cc12
InChI Key: InChIKey=HVAGKLZKSAONKO-JOCQHMNTSA-N
Data: 2 IC50
Activity Spreadsheet -- Enzyme Inhibition Constant Data from BindingDB
Found 2 hits for monomerid = 50242695
Trg + Lig
Ki
nM
ΔG°
kcal/mole
IC50
nM
Kd
nM
EC50/IC50
nM
koff
s-1
kon
M-1s-1
pHTemp
°C
Interleukin-1 receptor-associated kinase 4
(Homo sapiens (Human))
BDBM50242695
(CHEMBL4068395 | US9932350, 2-6)
Show SMILES CN(C)[C@H]1CC[C@@H](CC1)Nc1ncnc2ccc(Br)cc12 |r,wU:6.9,wD:3.2,(16.64,-34.34,;15.3,-33.58,;15.3,-32.04,;13.97,-34.35,;12.63,-33.58,;11.3,-34.36,;11.31,-35.89,;12.64,-36.66,;13.97,-35.89,;9.98,-36.66,;9.99,-38.2,;11.32,-38.96,;11.33,-40.51,;10,-41.29,;8.66,-40.52,;7.33,-41.3,;6,-40.53,;6,-38.98,;4.67,-38.21,;7.33,-38.21,;8.66,-38.98,)|
Show InChI InChI=1S/C16H21BrN4/c1-21(2)13-6-4-12(5-7-13)20-16-14-9-11(17)3-8-15(14)18-10-19-16/h3,8-10,12-13H,4-7H2,1-2H3,(H,18,19,20)/t12-,13-
Reactome pathway
US Patent
n/an/a 9n/an/an/an/an/an/a
Istanbul University
Assay Description
The kinase activity of IRAK4 is determined by its ability to catalyze the phosphorylation of a fluorescent polypeptide substrate. The extent of phosp...
Bioorg Med Chem 16: 9113-20 (2008)
BindingDB Entry DOI: 10.7270/Q2NS0X7R
Interleukin-1 receptor-associated kinase 4
(Homo sapiens (Human))
BDBM50242695
(CHEMBL4068395 | US9932350, 2-6)
Show SMILES CN(C)[C@H]1CC[C@@H](CC1)Nc1ncnc2ccc(Br)cc12 |r,wU:6.9,wD:3.2,(16.64,-34.34,;15.3,-33.58,;15.3,-32.04,;13.97,-34.35,;12.63,-33.58,;11.3,-34.36,;11.31,-35.89,;12.64,-36.66,;13.97,-35.89,;9.98,-36.66,;9.99,-38.2,;11.32,-38.96,;11.33,-40.51,;10,-41.29,;8.66,-40.52,;7.33,-41.3,;6,-40.53,;6,-38.98,;4.67,-38.21,;7.33,-38.21,;8.66,-38.98,)|
Show InChI InChI=1S/C16H21BrN4/c1-21(2)13-6-4-12(5-7-13)20-16-14-9-11(17)3-8-15(14)18-10-19-16/h3,8-10,12-13H,4-7H2,1-2H3,(H,18,19,20)/t12-,13-
Reactome pathway
n/an/a 10n/an/an/an/an/an/a
AstraZeneca
Curated by ChEMBL
Assay Description
Inhibition of recombinant human full length GST tagged IRAK4 expressed in baculovirus infected Sf9 cells using RP7030 peptide as substrate after 30 m...
Bioorg Med Chem Lett 27: 2721-2726 (2017)
Article DOI: 10.1016/j.bmcl.2017.04.050
BindingDB Entry DOI: 10.7270/Q2RR21NQ