BDBM50242699 CHEMBL4060511
SMILES: O=S(=O)(C1CC1)N1CCN(CC1)[C@H]1CC[C@@H](CC1)Nc1ncnc2ccc(cc12)C#N
InChI Key: InChIKey=AXFNSXBYIDZYGS-IYARVYRRSA-N
Data: 1 IC50
Activity Spreadsheet -- Enzyme Inhibition Constant Data from BindingDB
Found 1 hit for monomerid = 50242699
Trg + Lig
Ki
nM
ΔG°
kcal/mole
IC50
nM
Kd
nM
EC50/IC50
nM
koff
s-1
kon
M-1s-1
pHTemp
°C
Interleukin-1 receptor-associated kinase 4
(Homo sapiens (Human))
BDBM50242699
(CHEMBL4060511)
Show SMILES O=S(=O)(C1CC1)N1CCN(CC1)[C@H]1CC[C@@H](CC1)Nc1ncnc2ccc(cc12)C#N |r,wU:15.20,wD:12.13,(36.95,-11.4,;37.73,-12.74,;38.5,-11.39,;39.06,-13.51,;39.84,-14.84,;40.61,-13.51,;36.4,-13.51,;36.39,-15.05,;35.06,-15.81,;33.74,-15.04,;33.72,-13.5,;35.06,-12.73,;32.4,-15.81,;31.07,-15.05,;29.73,-15.82,;29.74,-17.35,;31.08,-18.12,;32.4,-17.35,;28.41,-18.13,;28.42,-19.67,;29.76,-20.43,;29.77,-21.98,;28.43,-22.75,;27.1,-21.98,;25.77,-22.76,;24.43,-21.99,;24.43,-20.45,;25.76,-19.68,;27.1,-20.44,;23.1,-19.68,;21.76,-18.91,)|
Show InChI InChI=1S/C22H28N6O2S/c23-14-16-1-8-21-20(13-16)22(25-15-24-21)26-17-2-4-18(5-3-17)27-9-11-28(12-10-27)31(29,30)19-6-7-19/h1,8,13,15,17-19H,2-7,9-12H2,(H,24,25,26)/t17-,18-
Reactome pathway
n/an/a 3n/an/an/an/an/an/a
AstraZeneca
Curated by ChEMBL
Assay Description
Inhibition of recombinant human full length GST tagged IRAK4 expressed in baculovirus infected Sf9 cells using RP7030 peptide as substrate after 30 m...
Bioorg Med Chem Lett 27: 2721-2726 (2017)
Article DOI: 10.1016/j.bmcl.2017.04.050
BindingDB Entry DOI: 10.7270/Q2RR21NQ