BDBM50242923 1-[1-(3-Methoxyphenyl)-2-piperazin-1-ylethyl]cyclohexanol Dihydrochloride::CHEMBL469460
SMILES: COc1cccc(c1)C(CN1CCNCC1)C1(O)CCCCC1
InChI Key: InChIKey=UMSMPSYOGHOLME-UHFFFAOYSA-N
Data: 1 KI  1 IC50
Activity Spreadsheet -- Enzyme Inhibition Constant Data from BindingDB
Found 2 hits for monomerid = 50242923
Trg + Lig
Ki
nM
ΔG°
kcal/mole
IC50
nM
Kd
nM
EC50/IC50
nM
koff
s-1
kon
M-1s-1
pHTemp
°C
Sodium-dependent noradrenaline transporter
(Homo sapiens (Human))
BDBM50242923
(1-[1-(3-Methoxyphenyl)-2-piperazin-1-ylethyl]cyclo...)
Show SMILES COc1cccc(c1)C(CN1CCNCC1)C1(O)CCCCC1
Show InChI InChI=1S/C19H30N2O2/c1-23-17-7-5-6-16(14-17)18(15-21-12-10-20-11-13-21)19(22)8-3-2-4-9-19/h5-7,14,18,20,22H,2-4,8-13,15H2,1H3
Reactome pathway
745n/an/an/an/an/an/an/an/a
Wyeth Research
Curated by ChEMBL
Assay Description
Displacement of [3H]nisoxetine from human norepinephrine transporter expressed in MDCK-Net6 cells
J Med Chem 51: 4038-49 (2008)
Article DOI: 10.1021/jm8002262
BindingDB Entry DOI: 10.7270/Q2TB16PB
Sodium-dependent noradrenaline transporter
(Homo sapiens (Human))
BDBM50242923
(1-[1-(3-Methoxyphenyl)-2-piperazin-1-ylethyl]cyclo...)
Show SMILES COc1cccc(c1)C(CN1CCNCC1)C1(O)CCCCC1
Show InChI InChI=1S/C19H30N2O2/c1-23-17-7-5-6-16(14-17)18(15-21-12-10-20-11-13-21)19(22)8-3-2-4-9-19/h5-7,14,18,20,22H,2-4,8-13,15H2,1H3
Reactome pathway
n/an/a 870n/an/an/an/an/an/a
Wyeth Research
Curated by ChEMBL
Assay Description
Inhibition of norepinephrine uptake at human norepinephrine transporter expressed in MDCK-Net6 cells
J Med Chem 51: 4038-49 (2008)
Article DOI: 10.1021/jm8002262
BindingDB Entry DOI: 10.7270/Q2TB16PB