BDBM50242962 CHEMBL4079519
SMILES: COc1cc(ccc1O)[C@@H](O)[C@@H](C)Oc1c(OC)cc(\C=C\CO)cc1OC
InChI Key: InChIKey=QWCGMGGKYDSASC-IJVJVEAYSA-N
Data: 1 KI  1 IC50
Activity Spreadsheet -- Enzyme Inhibition Constant Data from BindingDB
Found 2 hits for monomerid = 50242962
Trg + Lig
Ki
nM
ΔG°
kcal/mole
IC50
nM
Kd
nM
EC50/IC50
nM
koff
s-1
kon
M-1s-1
pHTemp
°C
Sialidase A
(Streptococcus pneumoniae)
BDBM50242962
(CHEMBL4079519)
Show SMILES COc1cc(ccc1O)[C@@H](O)[C@@H](C)Oc1c(OC)cc(\C=C\CO)cc1OC |r|
Show InChI InChI=1S/C21H26O7/c1-13(20(24)15-7-8-16(23)17(12-15)25-2)28-21-18(26-3)10-14(6-5-9-22)11-19(21)27-4/h5-8,10-13,20,22-24H,9H2,1-4H3/b6-5+/t13-,20+/m1/s1
3.00E+3n/an/an/an/an/an/an/an/a
Korea Research Institute of Bioscience and Biotechnology
Curated by ChEMBL
Assay Description
Noncompetitive inhibition of Streptococcus pneumoniae sialidase NanA using 4-methylumbelliferyl-alpha-D-N-acetylneuraminic acid as substrate after 60...
Bioorg Med Chem Lett 27: 3060-3064 (2017)
Article DOI: 10.1016/j.bmcl.2017.05.055
BindingDB Entry DOI: 10.7270/Q2G73H5Z
Sialidase A
(Streptococcus pneumoniae)
BDBM50242962
(CHEMBL4079519)
Show SMILES COc1cc(ccc1O)[C@@H](O)[C@@H](C)Oc1c(OC)cc(\C=C\CO)cc1OC |r|
Show InChI InChI=1S/C21H26O7/c1-13(20(24)15-7-8-16(23)17(12-15)25-2)28-21-18(26-3)10-14(6-5-9-22)11-19(21)27-4/h5-8,10-13,20,22-24H,9H2,1-4H3/b6-5+/t13-,20+/m1/s1
n/an/a 1.60E+3n/an/an/an/an/an/a
Korea Research Institute of Bioscience and Biotechnology
Curated by ChEMBL
Assay Description
Inhibition of Streptococcus pneumoniae sialidase NanA using 4-methylumbelliferyl-alpha-D-N-acetylneuraminic acid as substrate after 60 mins by FRET a...
Bioorg Med Chem Lett 27: 3060-3064 (2017)
Article DOI: 10.1016/j.bmcl.2017.05.055
BindingDB Entry DOI: 10.7270/Q2G73H5Z