BDBM50243048 (S)-1-(3-(piperidin-3-ylcarbamoyl)-5-p-tolylthiophen-2-yl)urea::CHEMBL513191
SMILES: Cc1ccc(cc1)-c1cc(C(=O)N[C@H]2CCCNC2)c(NC(N)=O)s1
InChI Key: InChIKey=BKBOPZCRBCJLJD-ZDUSSCGKSA-N
Data: 2 IC50
Activity Spreadsheet -- Enzyme Inhibition Constant Data from BindingDB
Found 2 hits for monomerid = 50243048
Trg + Lig
Ki
nM
ΔG°
kcal/mole
IC50
nM
Kd
nM
EC50/IC50
nM
koff
s-1
kon
M-1s-1
pHTemp
°C
Cyclin-dependent kinase 2-associated protein 1
(Homo sapiens (Human))
BDBM50243048
((S)-1-(3-(piperidin-3-ylcarbamoyl)-5-p-tolylthioph...)
Show SMILES Cc1ccc(cc1)-c1cc(C(=O)N[C@H]2CCCNC2)c(NC(N)=O)s1 |r|
Show InChI InChI=1S/C18H22N4O2S/c1-11-4-6-12(7-5-11)15-9-14(17(25-15)22-18(19)24)16(23)21-13-3-2-8-20-10-13/h4-7,9,13,20H,2-3,8,10H2,1H3,(H,21,23)(H3,19,22,24)/t13-/m0/s1
n/an/a 5.50E+3n/an/an/an/an/an/a
AstraZeneca R&D Boston
Curated by ChEMBL
Assay Description
Inhibition of Cdk1
Bioorg Med Chem Lett 18: 4242-8 (2008)
Article DOI: 10.1016/j.bmcl.2008.05.016
BindingDB Entry DOI: 10.7270/Q2J102Z9
Serine/threonine-protein kinase Chk1
(Homo sapiens (Human))
BDBM50243048
((S)-1-(3-(piperidin-3-ylcarbamoyl)-5-p-tolylthioph...)
Show SMILES Cc1ccc(cc1)-c1cc(C(=O)N[C@H]2CCCNC2)c(NC(N)=O)s1 |r|
Show InChI InChI=1S/C18H22N4O2S/c1-11-4-6-12(7-5-11)15-9-14(17(25-15)22-18(19)24)16(23)21-13-3-2-8-20-10-13/h4-7,9,13,20H,2-3,8,10H2,1H3,(H,21,23)(H3,19,22,24)/t13-/m0/s1
Reactome pathway
n/an/a 10n/an/an/an/an/an/a
AstraZeneca R&D Boston
Curated by ChEMBL
Assay Description
Inhibition of Chk1
Bioorg Med Chem Lett 18: 4242-8 (2008)
Article DOI: 10.1016/j.bmcl.2008.05.016
BindingDB Entry DOI: 10.7270/Q2J102Z9
3D
3D Structure (docked)