BDBM50243191 3beta-(4-Chlorophenyl)-2beta-[3'-(4-methoxybenzyl)isoxazol-5-yl]-tropane hydrochloride::CHEMBL487874
SMILES: COc1ccc(Cc2cc(on2)[C@@H]2C3CCC(C[C@@H]2c2ccc(Cl)cc2)N3C)cc1
InChI Key: InChIKey=XSHISTSQXDXEMK-ZTKRIWFQSA-N
Data: 2 KI  1 IC50
Activity Spreadsheet -- Enzyme Inhibition Constant Data from BindingDB
Found 3 hits for monomerid = 50243191
Trg + Lig
Ki
nM
ΔG°
kcal/mole
IC50
nM
Kd
nM
EC50/IC50
nM
koff
s-1
kon
M-1s-1
pHTemp
°C
Sodium-dependent serotonin transporter
(Homo sapiens (Human))
BDBM50243191
(3beta-(4-Chlorophenyl)-2beta-[3'-(4-methoxybenzyl)...)
Show SMILES COc1ccc(Cc2cc(on2)[C@@H]2C3CCC(C[C@@H]2c2ccc(Cl)cc2)N3C)cc1 |r,THB:9:12:26:14.15|
Show InChI InChI=1S/C25H27ClN2O2/c1-28-20-9-12-23(28)25(22(15-20)17-5-7-18(26)8-6-17)24-14-19(27-30-24)13-16-3-10-21(29-2)11-4-16/h3-8,10-11,14,20,22-23,25H,9,12-13,15H2,1-2H3/t20?,22-,23?,25+/m1/s1
14.4n/an/an/an/an/an/an/an/a
Research Triangle Institute
Curated by ChEMBL
Assay Description
Displacement of [3H]paroxetine from 5HTT
Bioorg Med Chem 16: 6682-8 (2008)
Article DOI: 10.1016/j.bmc.2008.05.073
BindingDB Entry DOI: 10.7270/Q2NK3FX0
Sodium-dependent noradrenaline transporter
(Homo sapiens (Human))
BDBM50243191
(3beta-(4-Chlorophenyl)-2beta-[3'-(4-methoxybenzyl)...)
Show SMILES COc1ccc(Cc2cc(on2)[C@@H]2C3CCC(C[C@@H]2c2ccc(Cl)cc2)N3C)cc1 |r,THB:9:12:26:14.15|
Show InChI InChI=1S/C25H27ClN2O2/c1-28-20-9-12-23(28)25(22(15-20)17-5-7-18(26)8-6-17)24-14-19(27-30-24)13-16-3-10-21(29-2)11-4-16/h3-8,10-11,14,20,22-23,25H,9,12-13,15H2,1-2H3/t20?,22-,23?,25+/m1/s1
Reactome pathway
347n/an/an/an/an/an/an/an/a
Research Triangle Institute
Curated by ChEMBL
Assay Description
Displacement of [3H]nisoxetine from NET
Bioorg Med Chem 16: 6682-8 (2008)
Article DOI: 10.1016/j.bmc.2008.05.073
BindingDB Entry DOI: 10.7270/Q2NK3FX0
Sodium-dependent dopamine transporter
(Homo sapiens (Human))
BDBM50243191
(3beta-(4-Chlorophenyl)-2beta-[3'-(4-methoxybenzyl)...)
Show SMILES COc1ccc(Cc2cc(on2)[C@@H]2C3CCC(C[C@@H]2c2ccc(Cl)cc2)N3C)cc1 |r,THB:9:12:26:14.15|
Show InChI InChI=1S/C25H27ClN2O2/c1-28-20-9-12-23(28)25(22(15-20)17-5-7-18(26)8-6-17)24-14-19(27-30-24)13-16-3-10-21(29-2)11-4-16/h3-8,10-11,14,20,22-23,25H,9,12-13,15H2,1-2H3/t20?,22-,23?,25+/m1/s1
NCI pathway
Reactome pathway
n/an/a 6.10n/an/an/an/an/an/a
Research Triangle Institute
Curated by ChEMBL
Assay Description
Displacement of [3H]WIN-35428 from DAT
Bioorg Med Chem 16: 6682-8 (2008)
Article DOI: 10.1016/j.bmc.2008.05.073
BindingDB Entry DOI: 10.7270/Q2NK3FX0