BDBM50243203 (S)-1-(5-(4-(dimethylcarbamoyl)phenyl)-3-(piperidin-3-ylcarbamoyl)thiophen-2-yl)urea::CHEMBL527881
SMILES: CN(C)C(=O)c1ccc(cc1)-c1cc(C(=O)N[C@H]2CCCNC2)c(NC(N)=O)s1
InChI Key: InChIKey=QNLRIICTRHHTHA-AWEZNQCLSA-N
Data: 2 IC50
Activity Spreadsheet -- Enzyme Inhibition Constant Data from BindingDB
Found 2 hits for monomerid = 50243203
Trg + Lig
Ki
nM
ΔG°
kcal/mole
IC50
nM
Kd
nM
EC50/IC50
nM
koff
s-1
kon
M-1s-1
pHTemp
°C
Cyclin-dependent kinase 2-associated protein 1
(Homo sapiens (Human))
BDBM50243203
((S)-1-(5-(4-(dimethylcarbamoyl)phenyl)-3-(piperidi...)
Show SMILES CN(C)C(=O)c1ccc(cc1)-c1cc(C(=O)N[C@H]2CCCNC2)c(NC(N)=O)s1 |r|
Show InChI InChI=1S/C20H25N5O3S/c1-25(2)19(27)13-7-5-12(6-8-13)16-10-15(18(29-16)24-20(21)28)17(26)23-14-4-3-9-22-11-14/h5-8,10,14,22H,3-4,9,11H2,1-2H3,(H,23,26)(H3,21,24,28)/t14-/m0/s1
n/an/a 3.70E+3n/an/an/an/an/an/a
AstraZeneca R&D Boston
Curated by ChEMBL
Assay Description
Inhibition of Cdk1
Bioorg Med Chem Lett 18: 4242-8 (2008)
Article DOI: 10.1016/j.bmcl.2008.05.016
BindingDB Entry DOI: 10.7270/Q2J102Z9
Serine/threonine-protein kinase Chk1
(Homo sapiens (Human))
BDBM50243203
((S)-1-(5-(4-(dimethylcarbamoyl)phenyl)-3-(piperidi...)
Show SMILES CN(C)C(=O)c1ccc(cc1)-c1cc(C(=O)N[C@H]2CCCNC2)c(NC(N)=O)s1 |r|
Show InChI InChI=1S/C20H25N5O3S/c1-25(2)19(27)13-7-5-12(6-8-13)16-10-15(18(29-16)24-20(21)28)17(26)23-14-4-3-9-22-11-14/h5-8,10,14,22H,3-4,9,11H2,1-2H3,(H,23,26)(H3,21,24,28)/t14-/m0/s1
Reactome pathway
n/an/a 9n/an/an/an/an/an/a
AstraZeneca R&D Boston
Curated by ChEMBL
Assay Description
Inhibition of Chk1
Bioorg Med Chem Lett 18: 4242-8 (2008)
Article DOI: 10.1016/j.bmcl.2008.05.016
BindingDB Entry DOI: 10.7270/Q2J102Z9