BDBM50243295 CHEMBL4084293
SMILES: CNCCN(C)Cc1ccccc1Sc1ccccc1Cl
InChI Key: InChIKey=LJRVSAOLYGPTNR-UHFFFAOYSA-N
Data: 1 IC50
Activity Spreadsheet -- Enzyme Inhibition Constant Data from BindingDB
Found 1 hit for monomerid = 50243295
Trg + Lig
Ki
nM
ΔG°
kcal/mole
IC50
nM
Kd
nM
EC50/IC50
nM
koff
s-1
kon
M-1s-1
pHTemp
°C
Protein arginine N-methyltransferase 1
(Rattus norvegicus)
BDBM50243295
(CHEMBL4084293)
Show SMILES CNCCN(C)Cc1ccccc1Sc1ccccc1Cl
Show InChI InChI=1S/C17H21ClN2S/c1-19-11-12-20(2)13-14-7-3-5-9-16(14)21-17-10-6-4-8-15(17)18/h3-10,19H,11-13H2,1-2H3
Reactome pathway
n/an/a 6n/an/an/an/an/an/a
Zhejiang Sci-Tech University
Curated by ChEMBL
Assay Description
Inhibition of rat His-tagged PRMT1 (11 to 353 residues) expressed in Escherichia coli BL21(DE3) using biotinylated H4 peptide (1 to 21 residues) as s...
J Med Chem 60: 8888-8905 (2017)
Article DOI: 10.1021/acs.jmedchem.7b01134
BindingDB Entry DOI: 10.7270/Q27D2XHK