BDBM50243391 4-((2R)-2-{[(2R)-2-Hydroxy-2-(3-pyridyl)ethyl]amino}propyl)-3-isopropyloxy-1,1-biphenyl-4-carboxylic acid::CHEMBL452798
SMILES: CC(C)Oc1cc(ccc1C(O)=O)-c1ccc(C[C@@H](C)NC[C@H](O)c2cccnc2)cc1
InChI Key: InChIKey=KUTLABBTBPWHLG-KOSHJBKYSA-N
Data: 3 EC50
Activity Spreadsheet -- Enzyme Inhibition Constant Data from BindingDB
Found 3 hits for monomerid = 50243391
Trg + Lig
Ki
nM
ΔG°
kcal/mole
IC50
nM
Kd
nM
EC50/IC50
nM
koff
s-1
kon
M-1s-1
pHTemp
°C
Beta-2 adrenergic receptor
(Homo sapiens (Human))
BDBM50243391
(4-((2R)-2-{[(2R)-2-Hydroxy-2-(3-pyridyl)ethyl]amin...)
Show SMILES CC(C)Oc1cc(ccc1C(O)=O)-c1ccc(C[C@@H](C)NC[C@H](O)c2cccnc2)cc1 |r|
Show InChI InChI=1S/C26H30N2O4/c1-17(2)32-25-14-21(10-11-23(25)26(30)31)20-8-6-19(7-9-20)13-18(3)28-16-24(29)22-5-4-12-27-15-22/h4-12,14-15,17-18,24,28-29H,13,16H2,1-3H3,(H,30,31)/t18-,24+/m1/s1
Reactome pathway
n/an/an/an/a>1.00E+3n/an/an/an/a
Astellas Pharma Inc.
Curated by ChEMBL
Assay Description
Agonist activity at human recombinant beta2 adrenergic receptor expressed in CHO cells assessed as cAMP accumulation by enzyme immuno assay
J Med Chem 51: 4002-20 (2008)
Article DOI: 10.1021/jm8000345
BindingDB Entry DOI: 10.7270/Q2MS3SKD
Beta-1 adrenergic receptor
(Homo sapiens (Human))
BDBM50243391
(4-((2R)-2-{[(2R)-2-Hydroxy-2-(3-pyridyl)ethyl]amin...)
Show SMILES CC(C)Oc1cc(ccc1C(O)=O)-c1ccc(C[C@@H](C)NC[C@H](O)c2cccnc2)cc1 |r|
Show InChI InChI=1S/C26H30N2O4/c1-17(2)32-25-14-21(10-11-23(25)26(30)31)20-8-6-19(7-9-20)13-18(3)28-16-24(29)22-5-4-12-27-15-22/h4-12,14-15,17-18,24,28-29H,13,16H2,1-3H3,(H,30,31)/t18-,24+/m1/s1
Reactome pathway
n/an/an/an/a 80n/an/an/an/a
Astellas Pharma Inc.
Curated by ChEMBL
Assay Description
Agonist activity at human recombinant beta-1 adrenergic receptor expressed in CHO cells assessed as cAMP accumulation by enzyme immuno assay
J Med Chem 51: 4002-20 (2008)
Article DOI: 10.1021/jm8000345
BindingDB Entry DOI: 10.7270/Q2MS3SKD
Beta-3 adrenergic receptor
(Homo sapiens (Human))
BDBM50243391
(4-((2R)-2-{[(2R)-2-Hydroxy-2-(3-pyridyl)ethyl]amin...)
Show SMILES CC(C)Oc1cc(ccc1C(O)=O)-c1ccc(C[C@@H](C)NC[C@H](O)c2cccnc2)cc1 |r|
Show InChI InChI=1S/C26H30N2O4/c1-17(2)32-25-14-21(10-11-23(25)26(30)31)20-8-6-19(7-9-20)13-18(3)28-16-24(29)22-5-4-12-27-15-22/h4-12,14-15,17-18,24,28-29H,13,16H2,1-3H3,(H,30,31)/t18-,24+/m1/s1
Reactome pathway
n/an/an/an/a 0.0990n/an/an/an/a
Astellas Pharma Inc.
Curated by ChEMBL
Assay Description
Agonist activity at human recombinant beta3 adrenergic receptor expressed in CHO cells assessed as cAMP accumulation by enzyme immuno assay
J Med Chem 51: 4002-20 (2008)
Article DOI: 10.1021/jm8000345
BindingDB Entry DOI: 10.7270/Q2MS3SKD