BDBM50243465 (+)-1-[(1S)-1-(3-Chlorophenyl)-2-(dimethylamino)ethyl]cyclohexanol::CHEMBL448953
SMILES: CN(C)C[C@H](c1cccc(Cl)c1)C1(O)CCCCC1
InChI Key: InChIKey=ZUFCXVFSSJFSOT-OAHLLOKOSA-N
Data: 1 KI  2 IC50
Activity Spreadsheet -- Enzyme Inhibition Constant Data from BindingDB
Found 3 hits for monomerid = 50243465
Trg + Lig
Ki
nM
ΔG°
kcal/mole
IC50
nM
Kd
nM
EC50/IC50
nM
koff
s-1
kon
M-1s-1
pHTemp
°C
Sodium-dependent noradrenaline transporter
(Homo sapiens (Human))
BDBM50243465
((+)-1-[(1S)-1-(3-Chlorophenyl)-2-(dimethylamino)et...)
Show SMILES CN(C)C[C@H](c1cccc(Cl)c1)C1(O)CCCCC1 |r|
Show InChI InChI=1S/C16H24ClNO/c1-18(2)12-15(13-7-6-8-14(17)11-13)16(19)9-4-3-5-10-16/h6-8,11,15,19H,3-5,9-10,12H2,1-2H3/t15-/m1/s1
Reactome pathway
339n/an/an/an/an/an/an/an/a
Wyeth Research
Curated by ChEMBL
Assay Description
Displacement of [3H]nisoxetine from human norepinephrine transporter expressed in MDCK-Net6 cells
J Med Chem 51: 4038-49 (2008)
Article DOI: 10.1021/jm8002262
BindingDB Entry DOI: 10.7270/Q2TB16PB
Sodium-dependent serotonin transporter
(Homo sapiens (Human))
BDBM50243465
((+)-1-[(1S)-1-(3-Chlorophenyl)-2-(dimethylamino)et...)
Show SMILES CN(C)C[C@H](c1cccc(Cl)c1)C1(O)CCCCC1 |r|
Show InChI InChI=1S/C16H24ClNO/c1-18(2)12-15(13-7-6-8-14(17)11-13)16(19)9-4-3-5-10-16/h6-8,11,15,19H,3-5,9-10,12H2,1-2H3/t15-/m1/s1
n/an/a 155n/an/an/an/an/an/a
Wyeth Research
Curated by ChEMBL
Assay Description
Inhibition of 5HT uptake at human SERT expressed in human JAR cells
J Med Chem 51: 4038-49 (2008)
Article DOI: 10.1021/jm8002262
BindingDB Entry DOI: 10.7270/Q2TB16PB
Sodium-dependent noradrenaline transporter
(Homo sapiens (Human))
BDBM50243465
((+)-1-[(1S)-1-(3-Chlorophenyl)-2-(dimethylamino)et...)
Show SMILES CN(C)C[C@H](c1cccc(Cl)c1)C1(O)CCCCC1 |r|
Show InChI InChI=1S/C16H24ClNO/c1-18(2)12-15(13-7-6-8-14(17)11-13)16(19)9-4-3-5-10-16/h6-8,11,15,19H,3-5,9-10,12H2,1-2H3/t15-/m1/s1
Reactome pathway
n/an/a 303n/an/an/an/an/an/a
Wyeth Research
Curated by ChEMBL
Assay Description
Inhibition of norepinephrine uptake at human norepinephrine transporter expressed in MDCK-Net6 cells
J Med Chem 51: 4038-49 (2008)
Article DOI: 10.1021/jm8002262
BindingDB Entry DOI: 10.7270/Q2TB16PB