BDBM50243467 1-[1-(4-Chlorophenyl)-2-piperazin-1-ylethyl]cyclohexanol Dihydrochloride::CHEMBL459644
SMILES: OC1(CCCCC1)C(CN1CCNCC1)c1ccc(Cl)cc1
InChI Key: InChIKey=KHWNQEDSMGUKSX-UHFFFAOYSA-N
Data: 1 KI  1 IC50
Activity Spreadsheet -- Enzyme Inhibition Constant Data from BindingDB
Found 2 hits for monomerid = 50243467
Trg + Lig
Ki
nM
ΔG°
kcal/mole
IC50
nM
Kd
nM
EC50/IC50
nM
koff
s-1
kon
M-1s-1
pHTemp
°C
Sodium-dependent noradrenaline transporter
(Homo sapiens (Human))
BDBM50243467
(1-[1-(4-Chlorophenyl)-2-piperazin-1-ylethyl]cycloh...)
Show SMILES OC1(CCCCC1)C(CN1CCNCC1)c1ccc(Cl)cc1
Show InChI InChI=1S/C18H27ClN2O/c19-16-6-4-15(5-7-16)17(14-21-12-10-20-11-13-21)18(22)8-2-1-3-9-18/h4-7,17,20,22H,1-3,8-14H2
Reactome pathway
717n/an/an/an/an/an/an/an/a
Wyeth Research
Curated by ChEMBL
Assay Description
Displacement of [3H]nisoxetine from human norepinephrine transporter expressed in MDCK-Net6 cells
J Med Chem 51: 4038-49 (2008)
Article DOI: 10.1021/jm8002262
BindingDB Entry DOI: 10.7270/Q2TB16PB
Sodium-dependent serotonin transporter
(Homo sapiens (Human))
BDBM50243467
(1-[1-(4-Chlorophenyl)-2-piperazin-1-ylethyl]cycloh...)
Show SMILES OC1(CCCCC1)C(CN1CCNCC1)c1ccc(Cl)cc1
Show InChI InChI=1S/C18H27ClN2O/c19-16-6-4-15(5-7-16)17(14-21-12-10-20-11-13-21)18(22)8-2-1-3-9-18/h4-7,17,20,22H,1-3,8-14H2
n/an/a 1.53E+3n/an/an/an/an/an/a
Wyeth Research
Curated by ChEMBL
Assay Description
Inhibition of 5HT uptake at human SERT expressed in human JAR cells
J Med Chem 51: 4038-49 (2008)
Article DOI: 10.1021/jm8002262
BindingDB Entry DOI: 10.7270/Q2TB16PB