BDBM50243650 (2S,4S)-4-azido-1-((S)-2,6-diaminohexanoyl)pyrrolidine-2-carbonitrile::CHEMBL471731
SMILES: NCCCC[C@H](N)C(=O)N1C[C@H](C[C@H]1C#N)N=[N+]=[N-]
InChI Key: InChIKey=IQDBJMFMTDQDMI-GUBZILKMSA-N
Data: 5 IC50
Activity Spreadsheet -- Enzyme Inhibition Constant Data from BindingDB
Found 5 hits for monomerid = 50243650
Trg + Lig
Ki
nM
ΔG°
kcal/mole
IC50
nM
Kd
nM
EC50/IC50
nM
koff
s-1
kon
M-1s-1
pHTemp
°C
Dipeptidyl peptidase 9
(Homo sapiens (Human))
BDBM50243650
((2S,4S)-4-azido-1-((S)-2,6-diaminohexanoyl)pyrroli...)
Show SMILES NCCCC[C@H](N)C(=O)N1C[C@H](C[C@H]1C#N)N=[N+]=[N-] |r|
Show InChI InChI=1S/C11H19N7O/c12-4-2-1-3-10(14)11(19)18-7-8(16-17-15)5-9(18)6-13/h8-10H,1-5,7,12,14H2/t8-,9-,10-/m0/s1
n/an/a 25n/an/an/an/an/an/a
University of Antwerp
Curated by ChEMBL
Assay Description
Inhibition of DPP9 (unknown origin)
Bioorg Med Chem Lett 18: 4154-8 (2008)
Article DOI: 10.1016/j.bmcl.2008.05.080
BindingDB Entry DOI: 10.7270/Q2G160N3
Dipeptidyl peptidase 2 (DPP II)
(Homo sapiens (Human))
BDBM50243650
((2S,4S)-4-azido-1-((S)-2,6-diaminohexanoyl)pyrroli...)
Show SMILES NCCCC[C@H](N)C(=O)N1C[C@H](C[C@H]1C#N)N=[N+]=[N-] |r|
Show InChI InChI=1S/C11H19N7O/c12-4-2-1-3-10(14)11(19)18-7-8(16-17-15)5-9(18)6-13/h8-10H,1-5,7,12,14H2/t8-,9-,10-/m0/s1
n/an/a 310n/an/an/an/an/an/a
University of Antwerp
Curated by ChEMBL
Assay Description
Inhibition of DPP2 (unknown origin)
Bioorg Med Chem Lett 18: 4154-8 (2008)
Article DOI: 10.1016/j.bmcl.2008.05.080
BindingDB Entry DOI: 10.7270/Q2G160N3
Dipeptidyl peptidase IV
(Porphyromonas gingivalis)
BDBM50243650
((2S,4S)-4-azido-1-((S)-2,6-diaminohexanoyl)pyrroli...)
Show SMILES NCCCC[C@H](N)C(=O)N1C[C@H](C[C@H]1C#N)N=[N+]=[N-] |r|
Show InChI InChI=1S/C11H19N7O/c12-4-2-1-3-10(14)11(19)18-7-8(16-17-15)5-9(18)6-13/h8-10H,1-5,7,12,14H2/t8-,9-,10-/m0/s1
n/an/a 330n/an/an/an/an/an/a
University of Warwick
Curated by ChEMBL
Assay Description
Inhibition of Porphyromonas gingivalis N-terminal His-tagged DPP4 expressed in Escherichia coli using Gly-Pro-p-nitroanilide as substrate
Eur J Med Chem 139: 482-491 (2017)
Article DOI: 10.1016/j.ejmech.2017.08.024
BindingDB Entry DOI: 10.7270/Q25B050P
Dipeptidyl peptidase VIII
(Homo sapiens (Human))
BDBM50243650
((2S,4S)-4-azido-1-((S)-2,6-diaminohexanoyl)pyrroli...)
Show SMILES NCCCC[C@H](N)C(=O)N1C[C@H](C[C@H]1C#N)N=[N+]=[N-] |r|
Show InChI InChI=1S/C11H19N7O/c12-4-2-1-3-10(14)11(19)18-7-8(16-17-15)5-9(18)6-13/h8-10H,1-5,7,12,14H2/t8-,9-,10-/m0/s1
n/an/a 71n/an/an/an/an/an/a
University of Antwerp
Curated by ChEMBL
Assay Description
Inhibition of DPP8 (unknown origin)
Bioorg Med Chem Lett 18: 4154-8 (2008)
Article DOI: 10.1016/j.bmcl.2008.05.080
BindingDB Entry DOI: 10.7270/Q2G160N3
Dipeptidyl peptidase 4
(Homo sapiens (Human))
BDBM50243650
((2S,4S)-4-azido-1-((S)-2,6-diaminohexanoyl)pyrroli...)
Show SMILES NCCCC[C@H](N)C(=O)N1C[C@H](C[C@H]1C#N)N=[N+]=[N-] |r|
Show InChI InChI=1S/C11H19N7O/c12-4-2-1-3-10(14)11(19)18-7-8(16-17-15)5-9(18)6-13/h8-10H,1-5,7,12,14H2/t8-,9-,10-/m0/s1
Reactome pathway
n/an/a 2.20E+3n/an/an/an/an/an/a
University of Antwerp
Curated by ChEMBL
Assay Description
Inhibition of DPP4 (unknown origin)
Bioorg Med Chem Lett 18: 4154-8 (2008)
Article DOI: 10.1016/j.bmcl.2008.05.080
BindingDB Entry DOI: 10.7270/Q2G160N3