BDBM50243788 3-(pyridin-3-yl)cyclohex-2-enone::CHEMBL453229
SMILES: O=C1CCCC(=C1)c1cccnc1
InChI Key: InChIKey=ONIOZXVZKCKBPJ-UHFFFAOYSA-N
Data: 1 IC50
Activity Spreadsheet -- Enzyme Inhibition Constant Data from BindingDB
Found 1 hit for monomerid = 50243788
Trg + Lig
Ki
nM
ΔG°
kcal/mole
IC50
nM
Kd
nM
EC50/IC50
nM
koff
s-1
kon
M-1s-1
pHTemp
°C
Calmodulin-sensitive adenylate cyclase
(Bacillus anthracis)
BDBM50243788
(3-(pyridin-3-yl)cyclohex-2-enone | CHEMBL453229)
Show SMILES O=C1CCCC(=C1)c1cccnc1 |c:5|
Show InChI InChI=1S/C11H11NO/c13-11-5-1-3-9(7-11)10-4-2-6-12-8-10/h2,4,6-8H,1,3,5H2
NCI pathway
Reactome pathway
n/an/a>1.00E+5n/an/an/an/an/an/a
The University of Texas Medical Branch
Curated by ChEMBL
Assay Description
Inhibition of Bacilus anthracis edema factor-induced edema in RAW264.7 mouse macrophages by cAMP-specific ELISA
Bioorg Med Chem Lett 18: 4215-8 (2008)
Article DOI: 10.1016/j.bmcl.2008.05.059
BindingDB Entry DOI: 10.7270/Q29G5MMN