BDBM50243795 CHEMBL4077644
SMILES: Nc1n[nH]c(n1)N1CCC(CC1)N(CCc1ccc(Cl)cc1)Cc1ccccc1Cl
InChI Key: InChIKey=XZXJAFDALHMBFW-UHFFFAOYSA-N
Data: 7 IC50
Activity Spreadsheet -- Enzyme Inhibition Constant Data from BindingDB
Found 7 hits for monomerid = 50243795
Trg + Lig
Ki
nM
ΔG°
kcal/mole
IC50
nM
Kd
nM
EC50/IC50
nM
koff
s-1
kon
M-1s-1
pHTemp
°C
Chitotriosidase-1
(Mus musculus)
BDBM50243795
(CHEMBL4077644)
Show SMILES Nc1n[nH]c(n1)N1CCC(CC1)N(CCc1ccc(Cl)cc1)Cc1ccccc1Cl
Show InChI InChI=1S/C22H26Cl2N6/c23-18-7-5-16(6-8-18)9-12-30(15-17-3-1-2-4-20(17)24)19-10-13-29(14-11-19)22-26-21(25)27-28-22/h1-8,19H,9-15H2,(H3,25,26,27,28)
n/an/a 2.59E+3n/an/an/an/an/an/a
OncoArendi Therapeutics SA
Curated by ChEMBL
Assay Description
Inhibition of mouse recombinant full length C-terminal His-tagged chitotriosidase expressed in CHO-K1 cells using 4-methylumbelliferyl-beta-D-N,N',N\...
J Med Chem 61: 695-710 (2018)
Article DOI: 10.1021/acs.jmedchem.7b01051
BindingDB Entry DOI: 10.7270/Q2J105J5
Acidic mammalian chitinase (AMCase)
(Homo sapiens (Human))
BDBM50243795
(CHEMBL4077644)
Show SMILES Nc1n[nH]c(n1)N1CCC(CC1)N(CCc1ccc(Cl)cc1)Cc1ccccc1Cl
Show InChI InChI=1S/C22H26Cl2N6/c23-18-7-5-16(6-8-18)9-12-30(15-17-3-1-2-4-20(17)24)19-10-13-29(14-11-19)22-26-21(25)27-28-22/h1-8,19H,9-15H2,(H3,25,26,27,28)
n/an/a 3.5n/an/an/an/an/an/a
OncoArendi Therapeutics SA
Curated by ChEMBL
Assay Description
Inhibition of human recombinant full length C-terminal His-tagged acidic mammalian chitinase expressed in CHO-K1 cells using 4-methylumbelliferyl-bet...
J Med Chem 61: 695-710 (2018)
Article DOI: 10.1021/acs.jmedchem.7b01051
BindingDB Entry DOI: 10.7270/Q2J105J5
Chitinase 1
(Homo sapiens (Human))
BDBM50243795
(CHEMBL4077644)
Show SMILES Nc1n[nH]c(n1)N1CCC(CC1)N(CCc1ccc(Cl)cc1)Cc1ccccc1Cl
Show InChI InChI=1S/C22H26Cl2N6/c23-18-7-5-16(6-8-18)9-12-30(15-17-3-1-2-4-20(17)24)19-10-13-29(14-11-19)22-26-21(25)27-28-22/h1-8,19H,9-15H2,(H3,25,26,27,28)
n/an/a 149n/an/an/an/an/an/a
OncoArendi Therapeutics SA
Curated by ChEMBL
Assay Description
Inhibition of human recombinant full length C-terminal His-tagged chitotriosidase expressed in CHO-K1 cells using 4-methylumbelliferyl-beta-D-N,N',N\...
J Med Chem 61: 695-710 (2018)
Article DOI: 10.1021/acs.jmedchem.7b01051
BindingDB Entry DOI: 10.7270/Q2J105J5
1,3-beta-glucan synthase component GLS2
(Saccharomyces cerevisiae)
BDBM50243795
(CHEMBL4077644)
Show SMILES Nc1n[nH]c(n1)N1CCC(CC1)N(CCc1ccc(Cl)cc1)Cc1ccccc1Cl
Show InChI InChI=1S/C22H26Cl2N6/c23-18-7-5-16(6-8-18)9-12-30(15-17-3-1-2-4-20(17)24)19-10-13-29(14-11-19)22-26-21(25)27-28-22/h1-8,19H,9-15H2,(H3,25,26,27,28)
n/an/a 2.00E+3n/an/an/an/an/an/a
OncoArendi Therapeutics S.A.
Curated by ChEMBL
Assay Description
Displacement of Tracer Red from human ERG by fluorescence polarization assay
ACS Med Chem Lett 11: 1228-1235 (2020)
Acidic mammalian chitinase (AMCase)
(Homo sapiens (Human))
BDBM50243795
(CHEMBL4077644)
Show SMILES Nc1n[nH]c(n1)N1CCC(CC1)N(CCc1ccc(Cl)cc1)Cc1ccccc1Cl
Show InChI InChI=1S/C22H26Cl2N6/c23-18-7-5-16(6-8-18)9-12-30(15-17-3-1-2-4-20(17)24)19-10-13-29(14-11-19)22-26-21(25)27-28-22/h1-8,19H,9-15H2,(H3,25,26,27,28)
n/an/a 3n/an/an/an/an/an/a
OncoArendi Therapeutics S.A.
Curated by ChEMBL
Assay Description
Inhibition of full length recombinant C-terminal His-tagged human acidic mammalian chitinase expressed in CHOK1 cells assessed as reduction in chitin...
ACS Med Chem Lett 11: 1228-1235 (2020)
Chitinase 1
(Homo sapiens (Human))
BDBM50243795
(CHEMBL4077644)
Show SMILES Nc1n[nH]c(n1)N1CCC(CC1)N(CCc1ccc(Cl)cc1)Cc1ccccc1Cl
Show InChI InChI=1S/C22H26Cl2N6/c23-18-7-5-16(6-8-18)9-12-30(15-17-3-1-2-4-20(17)24)19-10-13-29(14-11-19)22-26-21(25)27-28-22/h1-8,19H,9-15H2,(H3,25,26,27,28)
n/an/a 104n/an/an/an/an/an/a
OncoArendi Therapeutics S.A.
Curated by ChEMBL
Assay Description
Inhibition of full length recombinant C-terminal His-taged human CHIT1 expressed in CHOK1 cells assessed as reduction in chitinolytic activity using ...
ACS Med Chem Lett 11: 1228-1235 (2020)
Acidic mammalian chitinase
(Mus musculus)
BDBM50243795
(CHEMBL4077644)
Show SMILES Nc1n[nH]c(n1)N1CCC(CC1)N(CCc1ccc(Cl)cc1)Cc1ccccc1Cl
Show InChI InChI=1S/C22H26Cl2N6/c23-18-7-5-16(6-8-18)9-12-30(15-17-3-1-2-4-20(17)24)19-10-13-29(14-11-19)22-26-21(25)27-28-22/h1-8,19H,9-15H2,(H3,25,26,27,28)
n/an/a 9.70n/an/an/an/an/an/a
OncoArendi Therapeutics SA
Curated by ChEMBL
Assay Description
Inhibition of [3H]WIN-35428 binding to the dopamine transporter
J Med Chem 61: 695-710 (2018)
Article DOI: 10.1021/acs.jmedchem.7b01051
BindingDB Entry DOI: 10.7270/Q2J105J5