BDBM50243797 (6R,8S)-6-(((3R,4R)-3-hydroxy-4-o-tolylpiperidin-1-yl)methyl)-5,6,7,8-tetrahydroquinolin-8-ol::CHEMBL488655
SMILES: Cc1ccccc1[C@H]1CCN(C[C@H]2C[C@H](O)c3ncccc3C2)C[C@@H]1O
InChI Key: InChIKey=UECVBKMBWUTOOU-DBOLQNLKSA-N
Data: 1 KI  1 IC50
Activity Spreadsheet -- Enzyme Inhibition Constant Data from BindingDB
Found 2 hits for monomerid = 50243797
Trg + Lig
Ki
nM
ΔG°
kcal/mole
IC50
nM
Kd
nM
EC50/IC50
nM
koff
s-1
kon
M-1s-1
pHTemp
°C
Nociceptin receptor
(Homo sapiens (Human))
BDBM50243797
((6R,8S)-6-(((3R,4R)-3-hydroxy-4-o-tolylpiperidin-1...)
Show SMILES Cc1ccccc1[C@H]1CCN(C[C@H]2C[C@H](O)c3ncccc3C2)C[C@@H]1O |r|
Show InChI InChI=1S/C22H28N2O2/c1-15-5-2-3-7-18(15)19-8-10-24(14-21(19)26)13-16-11-17-6-4-9-23-22(17)20(25)12-16/h2-7,9,16,19-21,25-26H,8,10-14H2,1H3/t16-,19-,20+,21+/m1/s1
Reactome pathway
51n/an/an/an/an/an/an/an/a
Tsukuba Research Institute
Curated by ChEMBL
Assay Description
Displacement of [125I][Tyr14]nociceptin from human ORL1 expressed in CHO cells
J Med Chem 51: 4021-9 (2008)
Article DOI: 10.1021/jm701590h
BindingDB Entry DOI: 10.7270/Q2KW5FTW
Potassium voltage-gated channel subfamily H member 2
(Homo sapiens (Human))
BDBM50243797
((6R,8S)-6-(((3R,4R)-3-hydroxy-4-o-tolylpiperidin-1...)
Show SMILES Cc1ccccc1[C@H]1CCN(C[C@H]2C[C@H](O)c3ncccc3C2)C[C@@H]1O |r|
Show InChI InChI=1S/C22H28N2O2/c1-15-5-2-3-7-18(15)19-8-10-24(14-21(19)26)13-16-11-17-6-4-9-23-22(17)20(25)12-16/h2-7,9,16,19-21,25-26H,8,10-14H2,1H3/t16-,19-,20+,21+/m1/s1
Reactome pathway
n/an/a>5.00E+4n/an/an/an/an/an/a
Tsukuba Research Institute
Curated by ChEMBL
Assay Description
Displacement of [35S]MK499 from human ERG K+ channel expressed in HEK293 cells
J Med Chem 51: 4021-9 (2008)
Article DOI: 10.1021/jm701590h
BindingDB Entry DOI: 10.7270/Q2KW5FTW