BDBM50243826 3-(6-methoxypyridin-2-yl)cyclohex-2-enone::CHEMBL486249
SMILES: COc1cccc(n1)C1=CC(=O)CCC1
InChI Key: InChIKey=IOGYBJGPCFGCSS-UHFFFAOYSA-N
Data: 1 IC50
Activity Spreadsheet -- Enzyme Inhibition Constant Data from BindingDB
Found 1 hit for monomerid = 50243826
Trg + Lig
Ki
nM
ΔG°
kcal/mole
IC50
nM
Kd
nM
EC50/IC50
nM
koff
s-1
kon
M-1s-1
pHTemp
°C
Calmodulin-sensitive adenylate cyclase
(Bacillus anthracis)
BDBM50243826
(3-(6-methoxypyridin-2-yl)cyclohex-2-enone | CHEMBL...)
Show SMILES COc1cccc(n1)C1=CC(=O)CCC1 |t:9|
Show InChI InChI=1S/C12H13NO2/c1-15-12-7-3-6-11(13-12)9-4-2-5-10(14)8-9/h3,6-8H,2,4-5H2,1H3
NCI pathway
Reactome pathway
n/an/a>1.00E+5n/an/an/an/an/an/a
The University of Texas Medical Branch
Curated by ChEMBL
Assay Description
Inhibition of Bacilus anthracis edema factor-induced edema in RAW264.7 mouse macrophages by cAMP-specific ELISA
Bioorg Med Chem Lett 18: 4215-8 (2008)
Article DOI: 10.1016/j.bmcl.2008.05.059
BindingDB Entry DOI: 10.7270/Q29G5MMN