BDBM50243903 CHEMBL4093643
SMILES: CCCCNS(=O)(=O)C[C@H]1C[C@H](C1)N(C)c1ncnc2[nH]ccc12
InChI Key: InChIKey=NICMHESAFMRERW-BETUJISGSA-N
Data: 3 IC50
Activity Spreadsheet -- Enzyme Inhibition Constant Data from BindingDB
Found 3 hits for monomerid = 50243903
Trg + Lig
Ki
nM
ΔG°
kcal/mole
IC50
nM
Kd
nM
EC50/IC50
nM
koff
s-1
kon
M-1s-1
pHTemp
°C
Non-receptor tyrosine-protein kinase TYK2
(Homo sapiens (Human))
BDBM50243903
(CHEMBL4093643)
Show SMILES CCCCNS(=O)(=O)C[C@H]1C[C@H](C1)N(C)c1ncnc2[nH]ccc12 |r,wD:11.13,9.8,(20.23,-10.66,;18.89,-11.43,;17.56,-10.65,;16.23,-11.42,;14.89,-10.65,;13.56,-11.42,;14.32,-12.75,;12.79,-12.74,;12.23,-10.66,;10.9,-11.43,;9.41,-11.04,;9.01,-12.53,;10.5,-12.92,;7.68,-13.31,;6.35,-12.54,;7.69,-14.85,;6.36,-15.62,;6.36,-17.16,;7.69,-17.93,;9.03,-17.15,;10.5,-17.62,;11.4,-16.37,;10.49,-15.13,;9.02,-15.61,)|
Show InChI InChI=1S/C16H25N5O2S/c1-3-4-6-20-24(22,23)10-12-8-13(9-12)21(2)16-14-5-7-17-15(14)18-11-19-16/h5,7,11-13,20H,3-4,6,8-10H2,1-2H3,(H,17,18,19)/t12-,13+
n/an/a>2.00E+5n/an/an/an/an/an/a
Pfizer Inc.
Curated by ChEMBL
Assay Description
Inhibition of recombinant human TYK2 using 5'FAM-KKSRGDYMTMQID as substrate in presence of 1 mM ATP by mobility shift assay
J Med Chem 61: 1130-1152 (2018)
Article DOI: 10.1021/acs.jmedchem.7b01598
BindingDB Entry DOI: 10.7270/Q2D79DTW
Tyrosine-protein kinase JAK1
(Homo sapiens (Human))
BDBM50243903
(CHEMBL4093643)
Show SMILES CCCCNS(=O)(=O)C[C@H]1C[C@H](C1)N(C)c1ncnc2[nH]ccc12 |r,wD:11.13,9.8,(20.23,-10.66,;18.89,-11.43,;17.56,-10.65,;16.23,-11.42,;14.89,-10.65,;13.56,-11.42,;14.32,-12.75,;12.79,-12.74,;12.23,-10.66,;10.9,-11.43,;9.41,-11.04,;9.01,-12.53,;10.5,-12.92,;7.68,-13.31,;6.35,-12.54,;7.69,-14.85,;6.36,-15.62,;6.36,-17.16,;7.69,-17.93,;9.03,-17.15,;10.5,-17.62,;11.4,-16.37,;10.49,-15.13,;9.02,-15.61,)|
Show InChI InChI=1S/C16H25N5O2S/c1-3-4-6-20-24(22,23)10-12-8-13(9-12)21(2)16-14-5-7-17-15(14)18-11-19-16/h5,7,11-13,20H,3-4,6,8-10H2,1-2H3,(H,17,18,19)/t12-,13+
Reactome pathway
n/an/a 30n/an/an/an/an/an/a
Pfizer Inc.
Curated by ChEMBL
Assay Description
Inhibition of recombinant human JAK1 using 5'FAM-KKSRGDYMTMQID as substrate in presence of 1 mM ATP by mobility shift assay
J Med Chem 61: 1130-1152 (2018)
Article DOI: 10.1021/acs.jmedchem.7b01598
BindingDB Entry DOI: 10.7270/Q2D79DTW
Tyrosine-protein kinase JAK2
(Homo sapiens (Human))
BDBM50243903
(CHEMBL4093643)
Show SMILES CCCCNS(=O)(=O)C[C@H]1C[C@H](C1)N(C)c1ncnc2[nH]ccc12 |r,wD:11.13,9.8,(20.23,-10.66,;18.89,-11.43,;17.56,-10.65,;16.23,-11.42,;14.89,-10.65,;13.56,-11.42,;14.32,-12.75,;12.79,-12.74,;12.23,-10.66,;10.9,-11.43,;9.41,-11.04,;9.01,-12.53,;10.5,-12.92,;7.68,-13.31,;6.35,-12.54,;7.69,-14.85,;6.36,-15.62,;6.36,-17.16,;7.69,-17.93,;9.03,-17.15,;10.5,-17.62,;11.4,-16.37,;10.49,-15.13,;9.02,-15.61,)|
Show InChI InChI=1S/C16H25N5O2S/c1-3-4-6-20-24(22,23)10-12-8-13(9-12)21(2)16-14-5-7-17-15(14)18-11-19-16/h5,7,11-13,20H,3-4,6,8-10H2,1-2H3,(H,17,18,19)/t12-,13+
Reactome pathway
n/an/a 708n/an/an/an/an/an/a
Pfizer Inc.
Curated by ChEMBL
Assay Description
Inhibition of recombinant human JAK2 using FITC-KGGEEEEYFELVKK as substrate in presence of 1 mM ATP by mobility shift assay
J Med Chem 61: 1130-1152 (2018)
Article DOI: 10.1021/acs.jmedchem.7b01598
BindingDB Entry DOI: 10.7270/Q2D79DTW