null
SMILES: CN([C@@H]1C[C@H](CS(=O)(=O)NCC2CC2)C1)c1ncnc2[nH]ccc12
InChI Key: InChIKey=RIJDUKQOVGDMLM-BETUJISGSA-N
Activity Spreadsheet -- Enzyme Inhibition Constant Data from BindingDB
Found 3 hits for monomerid = 50243909
Trg + Lig
Ki
nM
ΔG°
kcal/mole
IC50
nM
Kd
nM
EC50/IC50
nM
koff
s-1
kon
M-1s-1
pHTemp
°C
Tyrosine-protein kinase JAK2
(Homo sapiens (Human))
BDBM50243909
(CHEMBL4066876)
Show SMILES CN([C@@H]1C[C@H](CS(=O)(=O)NCC2CC2)C1)c1ncnc2[nH]ccc12 |r,wD:2.1,4.4,(6.35,-12.54,;7.68,-13.31,;9.01,-12.53,;9.41,-11.04,;10.9,-11.43,;12.23,-10.66,;13.56,-11.42,;14.32,-12.75,;12.79,-12.74,;14.89,-10.65,;16.23,-11.42,;17.56,-10.65,;19.1,-10.65,;18.33,-9.31,;10.5,-12.92,;7.69,-14.85,;6.36,-15.62,;6.36,-17.16,;7.69,-17.93,;9.03,-17.15,;10.5,-17.62,;11.4,-16.37,;10.49,-15.13,;9.02,-15.61,)|
Show InChI InChI=1S/C16H23N5O2S/c1-21(16-14-4-5-17-15(14)18-10-19-16)13-6-12(7-13)9-24(22,23)20-8-11-2-3-11/h4-5,10-13,20H,2-3,6-9H2,1H3,(H,17,18,19)/t12-,13+
Reactome pathway
n/an/a 199n/an/an/an/an/an/a
Pfizer Inc.
Curated by ChEMBL
Assay Description
The ability to inhibit [3H]domperidone binding to dopamine receptor D2 in rat striata
J Med Chem 61: 1130-1152 (2018)
Article DOI: 10.1021/acs.jmedchem.7b01598
BindingDB Entry DOI: 10.7270/Q2D79DTW
Tyrosine-protein kinase JAK1
(Homo sapiens (Human))
BDBM50243909
(CHEMBL4066876)
Show SMILES CN([C@@H]1C[C@H](CS(=O)(=O)NCC2CC2)C1)c1ncnc2[nH]ccc12 |r,wD:2.1,4.4,(6.35,-12.54,;7.68,-13.31,;9.01,-12.53,;9.41,-11.04,;10.9,-11.43,;12.23,-10.66,;13.56,-11.42,;14.32,-12.75,;12.79,-12.74,;14.89,-10.65,;16.23,-11.42,;17.56,-10.65,;19.1,-10.65,;18.33,-9.31,;10.5,-12.92,;7.69,-14.85,;6.36,-15.62,;6.36,-17.16,;7.69,-17.93,;9.03,-17.15,;10.5,-17.62,;11.4,-16.37,;10.49,-15.13,;9.02,-15.61,)|
Show InChI InChI=1S/C16H23N5O2S/c1-21(16-14-4-5-17-15(14)18-10-19-16)13-6-12(7-13)9-24(22,23)20-8-11-2-3-11/h4-5,10-13,20H,2-3,6-9H2,1H3,(H,17,18,19)/t12-,13+
Reactome pathway
n/an/a 11n/an/an/an/an/an/a
Pfizer Inc.
Curated by ChEMBL
Assay Description
Inhibition of recombinant human JAK1 using 5'FAM-KKSRGDYMTMQID as substrate in presence of 1 mM ATP by mobility shift assay
J Med Chem 61: 1130-1152 (2018)
Article DOI: 10.1021/acs.jmedchem.7b01598
BindingDB Entry DOI: 10.7270/Q2D79DTW
Non-receptor tyrosine-protein kinase TYK2
(Homo sapiens (Human))
BDBM50243909
(CHEMBL4066876)
Show SMILES CN([C@@H]1C[C@H](CS(=O)(=O)NCC2CC2)C1)c1ncnc2[nH]ccc12 |r,wD:2.1,4.4,(6.35,-12.54,;7.68,-13.31,;9.01,-12.53,;9.41,-11.04,;10.9,-11.43,;12.23,-10.66,;13.56,-11.42,;14.32,-12.75,;12.79,-12.74,;14.89,-10.65,;16.23,-11.42,;17.56,-10.65,;19.1,-10.65,;18.33,-9.31,;10.5,-12.92,;7.69,-14.85,;6.36,-15.62,;6.36,-17.16,;7.69,-17.93,;9.03,-17.15,;10.5,-17.62,;11.4,-16.37,;10.49,-15.13,;9.02,-15.61,)|
Show InChI InChI=1S/C16H23N5O2S/c1-21(16-14-4-5-17-15(14)18-10-19-16)13-6-12(7-13)9-24(22,23)20-8-11-2-3-11/h4-5,10-13,20H,2-3,6-9H2,1H3,(H,17,18,19)/t12-,13+
n/an/a>2.00E+5n/an/an/an/an/an/a
Pfizer Inc.
Curated by ChEMBL
Assay Description
Inhibition of [3H]GR-65630 binding to 5-hydroxytryptamine 3 receptor
J Med Chem 61: 1130-1152 (2018)
Article DOI: 10.1021/acs.jmedchem.7b01598
BindingDB Entry DOI: 10.7270/Q2D79DTW