null
SMILES: CCOc1ccc(Cc2nc3cc(ccc3n2CC2CC2)C(=O)N(CC)CC)nc1
InChI Key: InChIKey=RJYQAFGYQJXSBT-UHFFFAOYSA-N
Activity Spreadsheet -- Enzyme Inhibition Constant Data from BindingDB
Found 3 hits for monomerid = 50244099
Trg + Lig
Ki
nM
ΔG°
kcal/mole
IC50
nM
Kd
nM
EC50/IC50
nM
koff
s-1
kon
M-1s-1
pHTemp
°C
Cannabinoid receptor 2
(Homo sapiens (Human))
BDBM50244099
(1-(cyclopropylmethyl)-2-((5-ethoxypyridin-2-yl)met...)
Show SMILES CCOc1ccc(Cc2nc3cc(ccc3n2CC2CC2)C(=O)N(CC)CC)nc1
Show InChI InChI=1S/C24H30N4O2/c1-4-27(5-2)24(29)18-9-12-22-21(13-18)26-23(28(22)16-17-7-8-17)14-19-10-11-20(15-25-19)30-6-3/h9-13,15,17H,4-8,14,16H2,1-3H3
Reactome pathway
27n/an/an/an/an/an/an/an/a
AstraZeneca R&D Montréal
Curated by ChEMBL
Assay Description
Displacement of [3H]CP55940 from human CB2 receptor
Bioorg Med Chem Lett 18: 3695-700 (2008)
Article DOI: 10.1016/j.bmcl.2008.05.073
BindingDB Entry DOI: 10.7270/Q2J38SBN
Cannabinoid receptor 1
(Homo sapiens (Human))
BDBM50244099
(1-(cyclopropylmethyl)-2-((5-ethoxypyridin-2-yl)met...)
Show SMILES CCOc1ccc(Cc2nc3cc(ccc3n2CC2CC2)C(=O)N(CC)CC)nc1
Show InChI InChI=1S/C24H30N4O2/c1-4-27(5-2)24(29)18-9-12-22-21(13-18)26-23(28(22)16-17-7-8-17)14-19-10-11-20(15-25-19)30-6-3/h9-13,15,17H,4-8,14,16H2,1-3H3
NCI pathway
Reactome pathway
>5.00E+3n/an/an/an/an/an/an/an/a
AstraZeneca R&D Montréal
Curated by ChEMBL
Assay Description
Displacement of [3H]CP55940 from human CB1 receptor
Bioorg Med Chem Lett 18: 3695-700 (2008)
Article DOI: 10.1016/j.bmcl.2008.05.073
BindingDB Entry DOI: 10.7270/Q2J38SBN
Cannabinoid receptor 2
(Homo sapiens (Human))
BDBM50244099
(1-(cyclopropylmethyl)-2-((5-ethoxypyridin-2-yl)met...)
Show SMILES CCOc1ccc(Cc2nc3cc(ccc3n2CC2CC2)C(=O)N(CC)CC)nc1
Show InChI InChI=1S/C24H30N4O2/c1-4-27(5-2)24(29)18-9-12-22-21(13-18)26-23(28(22)16-17-7-8-17)14-19-10-11-20(15-25-19)30-6-3/h9-13,15,17H,4-8,14,16H2,1-3H3
Reactome pathway
n/an/an/an/a 22n/an/an/an/a
AstraZeneca R&D Montréal
Curated by ChEMBL
Assay Description
Agonist activity at cloned human CB2 receptor in Sf9 cells assessed as stimulation of [35S]GTPgammaS binding assay
Bioorg Med Chem Lett 18: 3695-700 (2008)
Article DOI: 10.1016/j.bmcl.2008.05.073
BindingDB Entry DOI: 10.7270/Q2J38SBN